1,1,1,2,2,3,3,4,4,5,5,6,6,7,7,8,8,9,9,10,10,11,11,12,12-Pentacosofluorooctacosane

Phase change data

Data compiled as indicated in comments:
TRC - Thermodynamics Research Center, NIST Boulder Laboratories, Chris Muzny director
AC - William E. Acree, Jr., James S. Chickos

Quantity Value Units Method Reference Comment
Tfus363.KN/ARussell, Rabolt, et al., 1986Uncertainty assigned by TRC = 0.1 K; TRC

Enthalpy of fusion

ΔfusH (kcal/mol) Temperature (K) Method Reference Comment
10.3263.2DSCRussell, Rabolt, et al., 1986, 2AC

In addition to the Thermodynamics Research Center (TRC) data available from this site, much more physical and chemical property data is available from the following TRC products:

References

Russell, Rabolt, et al., 1986
Russell, T.P.; Rabolt, J.F.; Twieg, R.J.; Siemens, R.L.; Farmer, B.L., Structural characterization of semifluorinated n-alkanes. 2. Solid-solid transition behavior, Macromolecules, 1986, 19, 4, 1135, https://doi.org/10.1021/ma00158a035 . [all data]

Russell, Rabolt, et al., 1986, 2
Russell, Thomas P.; Rabolt, John F.; Twieg, Robert J.; Siemens, Richard L.; Farmer, Barry L., Structural characterization of semifluorinated n-alkanes. 2. Solid-solid transition behavior, Macromolecules, 1986, 19, 4, 1135-1143, https://doi.org/10.1021/ma00158a035 . [all data]