2-Naphthyl benzoate

Phase change data

Data compiled as indicated in comments:
TRC - Thermodynamics Research Center, NIST Boulder Laboratories, Chris Muzny director
AC - William E. Acree, Jr., James S. Chickos

Quantity Value Units Method Reference Comment
Tfus381.2KN/AKhetarpal, Lal, et al., 1981Uncertainty assigned by TRC = 0.5 K; TRC

Enthalpy of fusion

ΔfusH (kJ/mol) Temperature (K) Reference Comment
26.23381.2Bystrom, 1981AC

In addition to the Thermodynamics Research Center (TRC) data available from this site, much more physical and chemical property data is available from the following TRC products:

References

Khetarpal, Lal, et al., 1981
Khetarpal, S.C.; Lal, K.; Bhatnagar, H.L., Indian J. Chem., 1981, 446. [all data]

Bystrom, 1981
Bystrom, K., Enthalpies of combustion, vaporization, and formation for di-n-propyldiazene N-oxide and di-t-butyldiazene N-oxide, J. Chem. Thermodyn., 1981, 13, 139-145. [all data]