Phenol, 2-methoxy-4-(2-propenyl)-, acetate

Normal alkane RI, non-polar column, temperature ramp

Data compiled by: NIST Mass Spectrometry Data Center, William E. Wallace, director

Column type CapillaryCapillaryCapillaryCapillaryCapillary
Active phase CP-Sil 5 CBSE-54ZB-5FSOT-RSL-200BP-1
Column length (m) 25.30.30.30.30.
Carrier gas HeliumHelium HydrogenN2
Substrate
Column diameter (mm) 0.250.250.250.320.32
Phase thickness (μm) 0.150.250.250.250.25
Tstart (C) 50.60.60.40.60.
Tend (C) 220.260.220.280.220.
Heat rate (K/min)  2.4.6.5.
Initial hold (min)  5.5.5.
Final hold (min)  20.20.5.15.
I 1523.1526.1531.1522.1485.
ReferenceAmeen, Usman, et al., 2011Alma, Ertas, et al., 2007Mohottalage, Tabacchi, et al., 2007Schmidt, Jirovetz, et al., 2006Srivastava, Srivastava, et al., 2005
Comment MSDC-RI MSDC-RI MSDC-RI MSDC-RI MSDC-RI
Column type CapillaryCapillaryCapillaryCapillary
Active phase HP-5DB-1CBP-1DB-1
Column length (m) 25.30.25.50.
Carrier gas H2N2Nitrogen
Substrate
Column diameter (mm) 0.320.250.250.32
Phase thickness (μm) 0.520.250.25
Tstart (C) 40.50.50.50.
Tend (C) 240.200.210.250.
Heat rate (K/min) 4.5.3.3.
Initial hold (min)   2.
Final hold (min)
I 1524.1474.1484.1485.
ReferenceSimic, Sokovic, et al., 2004Fekam Boyom, Ngouana, et al., 2003Ly, Yamauchi, et al., 2001Habu, Flath, et al., 1985
Comment MSDC-RI MSDC-RI MSDC-RI MSDC-RI

Van Den Dool and Kratz RI, polar column, custom temperature program

Data compiled by: NIST Mass Spectrometry Data Center, William E. Wallace, director

Column type Capillary
Active phase RTX-Wax
Column length (m) 60.
Carrier gas
Substrate
Column diameter (mm) 0.25
Phase thickness (μm) 0.25
Program not specified
I 2263.
ReferenceCavalli, Ranarivelo, et al., 2001
Comment MSDC-RI

References

Ameen, Usman, et al., 2011
Ameen, O.M.; Usman, L.A.; Oganija, F.S.; Hamid, A.A.; Muhammed, N.O.; Zubair, M.F.; Adebayo, S.A., Chemical composition of leaf essential oil of Annona senegalensis Pers. (Annonaceae) growing in North Central Nigeria, Int. J. Biol. Chem. Sci., 2011, 5, 1, 375-379. [all data]

Alma, Ertas, et al., 2007
Alma, M.H.; Ertas, M.; Nitz, S.; Kollmannsberger, H., Chemical composition and content of essential oil from the bud of cultivated Turkish clove (Syzygium aromaticum L.), BioResources, 2007, 2, 2, 265-269. [all data]

Mohottalage, Tabacchi, et al., 2007
Mohottalage, S.; Tabacchi, R.; Guerin, P.M., Components from Sri Lankan Piper betle L. leaf oil and their analogues showing toxicity against the housefly, Musca domestica, Flavour Fragr. J., 2007, 22, 2, 130-138, https://doi.org/10.1002/ffj.1770 . [all data]

Schmidt, Jirovetz, et al., 2006
Schmidt, E.; Jirovetz, L.; Buchbauer, G.; Eller, G.A.; Stoilova, I.; Krastanov, A.; Stoyanova, A.; Geisseler, M., Composition and antioxidant activities of the essential oil of cinnamon (Cinnamomum zeylanicum Blume) leaves from Sri Lanka, Jeobp, 2006, 9, 2, 170-182. [all data]

Srivastava, Srivastava, et al., 2005
Srivastava, A.K.; Srivastava, S.K.; Syamsundar, K.V., Bud and leaf essential oil composition of Syzygium aromaticum from India and Madagascar, Flavour Fragr. J., 2005, 20, 1, 51-53, https://doi.org/10.1002/ffj.1364 . [all data]

Simic, Sokovic, et al., 2004
Simic, A.; Sokovic, M.D.; Ristic, M.; Grujic-Jovanovic, S.; Vukojevic, J.; Marin, P.D., The chemical composition of some Lauraceae essential oils and their antifungal activities, Phytother. Res., 2004, 18, 9, 713-717, https://doi.org/10.1002/ptr.1516 . [all data]

Fekam Boyom, Ngouana, et al., 2003
Fekam Boyom, F.; Ngouana, V.; Amvam Zollo, P.H.; Menut, C.; Bessiere, J.M.; Gut, J.; Rosenthal, P.J., Composition and anti-plasmodial activities of essential oils from some Cameroonian medicinal plants, Phytochemistry, 2003, 64, 7, 1269-1275, https://doi.org/10.1016/j.phytochem.2003.08.004 . [all data]

Ly, Yamauchi, et al., 2001
Ly, T.N.; Yamauchi, R.; KAto, K., Volatile components of the essential oils in Galanga (Alpina officinarum Hance) from Vietnam, Food Sci. Technol. Res., 2001, 7, 4, 303-306, https://doi.org/10.3136/fstr.7.303 . [all data]

Habu, Flath, et al., 1985
Habu, T.; Flath, R.A.; Mon, T.R.; Morton, J.F., Volatile components of Rooibos tea (Aspalathus linearis), J. Agric. Food Chem., 1985, 33, 2, 249-254, https://doi.org/10.1021/jf00062a024 . [all data]