Pyridine, 2-methyl-, 1-oxide

Phase change data

Data compiled by: William E. Acree, Jr., James S. Chickos

Quantity Value Units Method Reference Comment
Δsub22.2 ± 0.45kcal/molCCabral, Monteiro, et al., 2010
Δsub18.7 ± 0.53kcal/molCAcree Jr., 1995

References

Cabral, Monteiro, et al., 2010
Cabral, Joana I.T.A.; Monteiro, Ricardo A.R.; Rocha, Marisa A.A.; Santos, Luís M.N.B.F.; Acree, William E.; Ribeiro da Silva, Maria D.M.C., Molecular energetics of alkyl substituted pyridine N-oxides, J Therm Anal Calorim, 2010, 100, 2, 431-439, https://doi.org/10.1007/s10973-009-0646-7 . [all data]

Acree Jr., 1995
Acree Jr., Enthalpies of combustion of 4-nitropyridineN-oxide and pyridine-3-carboxylic acidN-oxide: the dissociation enthalpies of the N---O bonds in pyridineN-oxide derivatives, The Journal of Chemical Thermodynamics, 1995, 27, 4, 391-398, https://doi.org/10.1006/jcht.1995.0038 . [all data]