1,2-Cyclohexanediol

Condensed phase thermochemistry data

Data compiled by: Hussein Y. Afeefy, Joel F. Liebman, and Stephen E. Stein

Quantity Value Units Method Reference Comment
Δcsolid-3525.kJ/molCcbRoth and Muller, 1929Corresponding Δfsolid = -550.6 kJ/mol (simple calculation by NIST; no Washburn corrections)

References

Roth and Muller, 1929
Roth, W.A.; Muller, Fr., Die Zersetzungswarme der Stickstoffwasserstoffsaure, Ber., 1929, 62, 1188-1194. [all data]