3H-1,2,4-Triazol-3-one,1,2-dihydro-5-methyl-

Gas phase ion energetics data

Data compiled by: Sharon G. Lias, Rhoda D. Levin, and Sherif A. Kafafi

Ionization energy determinations

IE (eV) Method Reference Comment
8.76PEGuimon, Pfister-Guillouzo, et al., 1975Vertical value

References

Guimon, Pfister-Guillouzo, et al., 1975
Guimon, C.; Pfister-Guillouzo, G.; Arbelot, M., Spectres photoelectroniques d'J. Heterocycl. Chem. carbonyles et thiocarbonyles, Tetrahedron, 1975, 31, 2769. [all data]