Octane, 1-ethoxy-

Phase change data

Data compiled by: Thermodynamics Research Center, NIST Boulder Laboratories, Chris Muzny director

Quantity Value Units Method Reference Comment
Tboil459.7KN/ADevaney and Panian, 1953Uncertainty assigned by TRC = 0.8 K
Quantity Value Units Method Reference Comment
Tfus222.2KN/ADevaney and Panian, 1953Uncertainty assigned by TRC = 0.8 K

In addition to the Thermodynamics Research Center (TRC) data available from this site, much more physical and chemical property data is available from the following TRC products:

Kovats' RI, non-polar column, isothermal

View large format table.

Column type Active phase Temperature (C) I Reference Comment
PackedSE-30120.1084.Bierl, Beroza, et al., 1972Column length: 3.0 m

References

Devaney and Panian, 1953
Devaney, L.W.; Panian, G.W., Preparation and properties of some octyl ethers, J. Am. Chem. Soc., 1953, 75, 4836-7. [all data]

Bierl, Beroza, et al., 1972
Bierl, B.A.; Beroza, M.; Aldridge, M.H., Effect of functional-group position on retention indices of six classes of compounds on four stationary phases, J. Chromatogr. Sci., 1972, 10, 12, 712-715, https://doi.org/10.1093/chromsci/10.12.712 . [all data]