Biphenyl-4-carboxylic acid

Phase change data

Data compiled as indicated in comments:
TRC - Thermodynamics Research Center, NIST Boulder Laboratories, Chris Muzny director
AC - William E. Acree, Jr., James S. Chickos

Quantity Value Units Method Reference Comment
Tfus483.KN/AHammond and Todd, 1954Uncertainty assigned by TRC = 5. K; TRC
Quantity Value Units Method Reference Comment
Δsub30.47 ± 0.98kcal/molCMatos, Miranda, et al., 2004AC

In addition to the Thermodynamics Research Center (TRC) data available from this site, much more physical and chemical property data is available from the following TRC products:

References

Hammond and Todd, 1954
Hammond, G.S.; Todd, R.W., The Low Reactivity of Cyclopropane Derivatives twoard Free Radicals, J. Am. Chem. Soc., 1954, 76, 4081. [all data]

Matos, Miranda, et al., 2004
Matos, M. Agostinha R.; Miranda, Margarida S.; Martins, Diana V.S.S.; Pinto, Nat«65533»lia A.B.; Morais, Victor M.F.; Liebman, Joel F., Thermochemistry of biphenylcarboxylic and dicarboxylic acids. A combined experimental and theoretical studyThis paper is dedicated to Kurt Mislow, a pioneering biphenyl stereochemist, on the occasion of his 80th birthday., Org. Biomol. Chem., 2004, 2, 9, 1353, https://doi.org/10.1039/b401605j . [all data]