2-Hexen-1-ol, (E)-

Normal alkane RI, non-polar column, temperature ramp

Data compiled by: NIST Mass Spectrometry Data Center, William E. Wallace, director

Column type CapillaryCapillaryCapillaryCapillaryCapillary
Active phase HP-5 MSHP-5 MSHP-5 MSHP-5 MSDB-1
Column length (m) 30.30.30.30.30.
Carrier gas HeliumHeliumHeliumHeliumHe
Substrate
Column diameter (mm) 0.250.250.250.250.25
Phase thickness (μm) 0.250.250.250.250.25
Tstart (C) 100.70.70.50.30.
Tend (C) 220.290.290.230.210.
Heat rate (K/min) 2.5.5.4.5.
Initial hold (min)    4.
Final hold (min)  10.10.10.
I 849.854.857.861.854.
ReferencePripdeevech, Chumpolsri, et al., 2010Radulovic, Blagojevic, et al., 2010Radulovic, Dordevic, et al., 2010Forero, Quijano, et al., 2008Kumazawa, Itobe, et al., 2008
Comment MSDC-RI MSDC-RI MSDC-RI MSDC-RI MSDC-RI
Column type CapillaryCapillaryCapillaryCapillaryCapillary
Active phase HP-5HP-5MSElite-5MSHP-1HP-5
Column length (m) 10.30.30.50.30.
Carrier gas HeliumHeHeN2He
Substrate
Column diameter (mm) 0.100.250.320.20.25
Phase thickness (μm) 0.400.250.50.330.25
Tstart (C) 40.60.40.60.50.
Tend (C) 280.250.280.250.300.
Heat rate (K/min) 20.2.4.2.5.
Initial hold (min) 1.8.5. 5.
Final hold (min) 1.15.10.20.5.
I 874.852.866.845.865.
ReferenceMildner-Szkudlarz and Jelen, 2008Ferhat, Tigrine-Kordjani, et al., 2007Tava, Pecetti, et al., 2007Berlioz, Cordella, et al., 2006Figuérédo, Cabassu, et al., 2006
Comment MSDC-RI MSDC-RI MSDC-RI MSDC-RI MSDC-RI
Column type CapillaryCapillaryCapillaryCapillaryCapillary
Active phase HP-5HP-5 MSRTX-5SilRSL-200BPX-5
Column length (m) 30.30.30.30.30.
Carrier gas H2HeliumHe
Substrate
Column diameter (mm) 0.250.250.250.250.25
Phase thickness (μm) 0.250.250.250.250.25
Tstart (C) 50.60.45.40.40.
Tend (C) 280.250.200.280.200.
Heat rate (K/min) 4.2.3.6.5.
Initial hold (min) 2.8.5.2.8.
Final hold (min) 10.15. 10.10.
I 861.852.863.853.869.
ReferencePino, Sauri-Duch, et al., 2006Tigrine-Kordiani, Meklati, et al., 2006Holland, Larkov, et al., 2005Jirovetz, Buchbauer, et al., 2005Kalua, Allen, et al., 2005
Comment MSDC-RI MSDC-RI MSDC-RI MSDC-RI MSDC-RI
Column type CapillaryCapillaryCapillaryCapillaryCapillary
Active phase DB-1HP-5MSHP-1SE-54HP-5
Column length (m) 30.30.50.30.25.
Carrier gas N2HeN2HeHe
Substrate
Column diameter (mm) 0.250.250.20.250.2
Phase thickness (μm) 0.250.250.330.250.33
Tstart (C) 50.60.60.60.40.
Tend (C) 200.280.250.260.190.
Heat rate (K/min) 5.3.2.2.4.
Initial hold (min)  5. 5.
Final hold (min)   20. 5.
I 841.868.845.865.862.
ReferenceNyegue, Belinga-Ndoye, et al., 2005Setzer, Noletto, et al., 2005Cavalli, Fernandez, et al., 2004Kilic, Hafizoglu, et al., 2004Azodanlou, Darbellay, et al., 2003
Comment MSDC-RI MSDC-RI MSDC-RI MSDC-RI MSDC-RI
Column type CapillaryCapillaryCapillaryCapillaryCapillary
Active phase RSL-200RSL-200RSL-200CP Sil 5 CBMDN-5
Column length (m) 30.30.30.25.30.
Carrier gas H2H2H2HeHe
Substrate
Column diameter (mm) 0.320.250.320.250.25
Phase thickness (μm) 0.250.250.250.250.25
Tstart (C) 40.40.40.35.40.
Tend (C) 280.280.280.280.280.
Heat rate (K/min) 6.6.6.5.20.
Initial hold (min) 5.2.5.2.51.
Final hold (min) 5.10.5. 1.
I 853.853.852.843.874.
ReferenceJirovetz, Buchbauer, et al., 2003Jirovetz, Buchbauer, et al., 2003, 2Jirovetz, Buchbauer, et al., 2003, 3Kanjilal, Kotoky, et al., 2003Mildner-Szkudlarz, Jelen, et al., 2003
Comment MSDC-RI MSDC-RI MSDC-RI MSDC-RI MSDC-RI
Column type CapillaryCapillaryCapillaryCapillaryCapillary
Active phase HP-1SPB-1SPB-1SPB-1OV-101
Column length (m) 50.30.30.30.10.
Carrier gas HeHeHeHe
Substrate
Column diameter (mm) 0.20.250.250.250.25
Phase thickness (μm) 0.50.250.250.25
Tstart (C) 60.40.40.40.35.
Tend (C) 220.200.200.200.225.
Heat rate (K/min) 2.3.3.3.6.
Initial hold (min)  10.10.10.5.
Final hold (min) 40.
I 840.853.853.853.870.
ReferenceValette, Fernandez, et al., 2003Vichi, Castellote, et al., 2003Vichi, Pizzale, et al., 2003Vichi, Pizzale, et al., 2003, 2Bloss, Acree, et al., 2002
Comment MSDC-RI MSDC-RI MSDC-RI MSDC-RI MSDC-RI
Column type CapillaryCapillaryCapillaryCapillaryCapillary
Active phase DB-5RSL-200RSL-200SPB-5HP-5
Column length (m) 30.30.30.30.30.
Carrier gas HeH2H2HeliumN2
Substrate
Column diameter (mm) 0.250.320.250.250.25
Phase thickness (μm) 0.250.250.250.250.25
Tstart (C) 60.40.40.60.60.
Tend (C) 240.280.280.250.220.
Heat rate (K/min) 3.6.6.4.5.
Initial hold (min)  5.2.2.10.
Final hold (min)  5.10.20.
I 862.853.853.865.862.
ReferenceFlamini, Ertugrul, et al., 2002Jirovetz, Buchbauer, et al., 2002Jirovetz, Smith, et al., 2002Pino, Marbot, et al., 2002Campeol, Flamini, et al., 2001
Comment MSDC-RI MSDC-RI MSDC-RI MSDC-RI MSDC-RI
Column type CapillaryCapillaryCapillaryCapillaryCapillary
Active phase OV-101HP-1HP-1HP-1DB-1
Column length (m) 50.25.25.25.60.
Carrier gas NitrogenH2  He
Substrate
Column diameter (mm) 0.250.320.320.20.32
Phase thickness (μm)  0.17  0.50
Tstart (C) 40.40.35.35.50.
Tend (C) 200.260.250.200.250.
Heat rate (K/min) 2.3.4.5.8.
Initial hold (min) 10.5. 5.1.
Final hold (min)     6.
I 845.849.850.850.858.
ReferenceTamura, Boonbumrung, et al., 2000Lopes, Koketsu, et al., 1999Ong, Acree, et al., 1998Quiroz A. and Niemeyer H.M., 1998Sagrero-Nieves and Bartley, 1996
Comment MSDC-RI MSDC-RI MSDC-RI MSDC-RI MSDC-RI
Column type CapillaryCapillaryCapillaryCapillaryCapillary
Active phase SPB-1OV-101OV-101DB-5 MSDB-1
Column length (m) 50.15.15.30.30.
Carrier gas HeHeHeHeliumHe
Substrate
Column diameter (mm) 0.20.320.320.250.25
Phase thickness (μm) 0.33   0.25
Tstart (C) 40.35.35.50.50.
Tend (C) 200.250.250.250.240.
Heat rate (K/min) 3.6.6.4.5.
Initial hold (min) 3.3.3. 3.
Final hold (min) 30.
I 845.857.860.858.843.
ReferenceWong and Lai, 1996Chisholm, Guiher, et al., 1995Chisholm, Guiher, et al., 1995Gomez and Ledbetter, 1994Shiota, 1993
Comment MSDC-RI MSDC-RI MSDC-RI MSDC-RI MSDC-RI
Column type CapillaryCapillaryCapillaryCapillaryCapillary
Active phase DB-1OV-101OV-101DB-1DB-1
Column length (m) 30.50.50.60.60.
Carrier gas He
Substrate
Column diameter (mm) 0.250.250.250.320.32
Phase thickness (μm) 0.25
Tstart (C) 50.80.80.30.50.
Tend (C) 240.200.200.200.230.
Heat rate (K/min) 5.2.2.4.4.
Initial hold (min) 3.  25.
Final hold (min)    20.10.
I 844.845.846.844.844.
ReferenceShiota, 1993Tamura, Yang, et al., 1993Tamura, Yang, et al., 1993Hansen, Buttery, et al., 1992Binder, Benson, et al., 1990
Comment MSDC-RI MSDC-RI MSDC-RI MSDC-RI MSDC-RI
Column type CapillaryCapillaryCapillaryCapillary
Active phase DB-1OV-101OV-1DB-1
Column length (m) 60.50.50.50.
Carrier gas  N2Hydrogen
Substrate
Column diameter (mm) 0.320.250.200.32
Phase thickness (μm)
Tstart (C) 50.80.50.0.
Tend (C) 250.200.200.250.
Heat rate (K/min) 4.2.1.3.
Initial hold (min)
Final hold (min) 5. 35.
I 846.845.841.854.
ReferenceBinder, Flath, et al., 1989Sugisawa, Yamamoto, et al., 1989Wu, Liou, et al., 1987Habu, Flath, et al., 1985
Comment MSDC-RI MSDC-RI MSDC-RI MSDC-RI

Van Den Dool and Kratz RI, non-polar column, temperature ramp

Data compiled by: NIST Mass Spectrometry Data Center, William E. Wallace, director

Column type CapillaryCapillaryCapillaryCapillaryCapillary
Active phase DB-5DB-5HP-5DB-1HP-5
Column length (m) 30.30.30.25.30.
Carrier gas HeHeN2 N2
Substrate
Column diameter (mm) 0.250.250.250.20.25
Phase thickness (μm) 0.250.250.250.330.25
Tstart (C) 60.60.60.50.60.
Tend (C) 240.240.220.300.220.
Heat rate (K/min) 3.3.5.4.5.
Initial hold (min)   10. 10.
Final hold (min)
I 862.862.862.848.862.
ReferenceBaccouri, Ben Temime, et al., 2007Maccioni, Baldini, et al., 2007Flamini, Tebano, et al., 2006Osorio, Alarcon, et al., 2006Flamini, Luigi Cioni, et al., 2005
Comment MSDC-RI MSDC-RI MSDC-RI MSDC-RI MSDC-RI
Column type CapillaryCapillaryCapillaryCapillaryCapillary
Active phase DB-5MSHP-5SPB-5HP-1HP-1
Column length (m) 60.30.30.50.50.
Carrier gas He HeHeHe
Substrate
Column diameter (mm) 0.250.250.530.20.2
Phase thickness (μm) 0.250.251.50.330.33
Tstart (C) 40.60.100.60.60.
Tend (C) 200.220.250.250.250.
Heat rate (K/min) 2.5.5.2.2.
Initial hold (min)  10. 5.5.
Final hold (min) 20.  20.20.
I 879.861.856.845.845.
ReferenceSeo and Baek, 2005Ceccarini, Macchia, et al., 2004Rodríguez-Burruezo, Kollmannsberger, et al., 2004Cavalli, Fernandez, et al., 2003Cavalli, Fernandez, et al., 2003
Comment MSDC-RI MSDC-RI MSDC-RI MSDC-RI MSDC-RI
Column type CapillaryCapillaryCapillaryCapillaryCapillary
Active phase HP-1SPB-1DB-5CP Sil 5 CBDB-5
Column length (m) 50.30.30.60.30.
Carrier gas HeHeHeHeHe
Substrate
Column diameter (mm) 0.20.250.250.320.25
Phase thickness (μm) 0.330.250.250.251.
Tstart (C) 60.35.60.60.50.
Tend (C) 250.225.240.280.200.
Heat rate (K/min) 2.4.3.3.2.5
Initial hold (min) 5.5. 10.
Final hold (min) 20.20. 60.
I 846.856.862.833.885.7
ReferenceCavalli, Fernandez, et al., 2003Chisholm, Jell, et al., 2003Flamini, Luigi Cioni, et al., 2003Pino, Almora, et al., 2003Xu, van Stee, et al., 2003
Comment MSDC-RI MSDC-RI MSDC-RI MSDC-RI MSDC-RI
Column type CapillaryCapillaryCapillaryCapillaryCapillary
Active phase DB-5HP-5HP-5CP Sil 8 CBCP Sil 8 CB
Column length (m) 30.30.30.25.25.
Carrier gas HeHe
Substrate
Column diameter (mm) 0.250.250.320.20.2
Phase thickness (μm) 0.250.250.250.250.25
Tstart (C) 60.40.40.40.40.
Tend (C) 240.200.280.200.200.
Heat rate (K/min) 3.2.3.2.2.
Initial hold (min)  5.4.8.8.
Final hold (min)  20.
I 861.867.861.850.851.
ReferenceFlamini, Cioni, et al., 2002Kim, Thuy, et al., 2000Ruther, 2000Yassaa, Meklati, et al., 2000Yassaa, Meklati, et al., 2000
Comment MSDC-RI MSDC-RI MSDC-RI MSDC-RI MSDC-RI
Column type CapillaryCapillaryCapillaryCapillaryCapillary
Active phase DB-1DB-1OV-101OV-101OV-101
Column length (m) 25.25.25.25.25.
Carrier gas HeHeHeHeHe
Substrate
Column diameter (mm) 0.20.20.200.200.20
Phase thickness (μm) 0.110.11
Tstart (C) 50.50.60.60.60.
Tend (C) 250.250.260.260.260.
Heat rate (K/min) 5.5.1.1.2.
Initial hold (min)   8.8.0.
Final hold (min)   30.30.30.
I 849.850.851.860.849.
ReferenceWarthen, Lee, et al., 1997Warthen, Lee, et al., 1997Baaliouamer, Boudarene, et al., 1993Baaliouamer, Boudarene, et al., 1993Baaliouamer, Boudarene, et al., 1993
Comment MSDC-RI MSDC-RI MSDC-RI MSDC-RI MSDC-RI
Column type CapillaryCapillaryCapillaryCapillaryCapillary
Active phase OV-101OV-101OV-101OV-101OV-101
Column length (m) 25.25.25.25.25.
Carrier gas HeHeHeHeHe
Substrate
Column diameter (mm) 0.200.200.200.200.20
Phase thickness (μm)
Tstart (C) 60.60.60.60.60.
Tend (C) 260.260.260.260.260.
Heat rate (K/min) 2.2.2.2.2.
Initial hold (min) 0.8.8.8.8.
Final hold (min) 30.30.30.30.30.
I 855.849.850.859.859.
ReferenceBaaliouamer, Boudarene, et al., 1993Baaliouamer, Boudarene, et al., 1993Baaliouamer, Boudarene, et al., 1993Baaliouamer, Boudarene, et al., 1993Baaliouamer, Boudarene, et al., 1993
Comment MSDC-RI MSDC-RI MSDC-RI MSDC-RI MSDC-RI
Column type CapillaryCapillaryCapillaryCapillaryCapillary
Active phase OV-101OV-101OV-101OV-101OV-101
Column length (m) 25.25.25.25.25.
Carrier gas HeHeHeHeHe
Substrate
Column diameter (mm) 0.200.200.200.200.20
Phase thickness (μm)
Tstart (C) 60.60.70.70.80.
Tend (C) 260.260.260.260.260.
Heat rate (K/min) 4.4.2.2.2.
Initial hold (min) 8.8.8.8.8.
Final hold (min) 30.30.30.30.30.
I 855.863.847.860.845.
ReferenceBaaliouamer, Boudarene, et al., 1993Baaliouamer, Boudarene, et al., 1993Baaliouamer, Boudarene, et al., 1993Baaliouamer, Boudarene, et al., 1993Baaliouamer, Boudarene, et al., 1993
Comment MSDC-RI MSDC-RI MSDC-RI MSDC-RI MSDC-RI
Column type CapillaryCapillaryCapillaryCapillaryCapillary
Active phase OV-101HP-101DB-5OV-101OV-101
Column length (m) 25.50.30.50.50.
Carrier gas HeN2HeN2N2
Substrate
Column diameter (mm) 0.200.250.250.250.25
Phase thickness (μm)
Tstart (C) 80.70.50.80.80.
Tend (C) 260.200.250.200.200.
Heat rate (K/min) 2.3.4.2.2.
Initial hold (min) 8.
Final hold (min) 30.
I 854.870.858.845.846.
ReferenceBaaliouamer, Boudarene, et al., 1993Chung, Eiserich, et al., 1993Gómez, Ledbetter, et al., 1993Yang, Sugisawa, et al., 1992Yang, Sugisawa, et al., 1992
Comment MSDC-RI MSDC-RI MSDC-RI MSDC-RI MSDC-RI
Column type CapillaryCapillaryCapillary
Active phase DB-5OV-1OV-1
Column length (m) 0.3250.183.
Carrier gas H2H2
Substrate
Column diameter (mm) 1.0.20.762
Phase thickness (μm)
Tstart (C) 30.50.0.
Tend (C) 180.200.230.
Heat rate (K/min) 1.52.1.
Initial hold (min) 5.
Final hold (min)  55.
I 865.837.858.
ReferenceGuichard and Souty, 1988Wu and Liou, 1986Schreyen, Dirinck, et al., 1976
Comment MSDC-RI MSDC-RI MSDC-RI

Van Den Dool and Kratz RI, non-polar column, custom temperature program

Data compiled by: NIST Mass Spectrometry Data Center, William E. Wallace, director

Column type CapillaryCapillary
Active phase DB-5SE-52
Column length (m) 30.60.
Carrier gas HeHe
Substrate
Column diameter (mm) 0.320.32
Phase thickness (μm) 1.0.40
Program 40C(2min) => 5C/min => 100C => 4C/min => 230C (10min)45 C (6 min) 3 C/min -> 111 0C 2 C/min -> 160 C 3 C/min -> 300 C (15 min)
I 868.865.
ReferenceWang, Finn, et al., 2005Mondello, Dugo, et al., 1995
Comment MSDC-RI MSDC-RI

References

Pripdeevech, Chumpolsri, et al., 2010
Pripdeevech, P.; Chumpolsri, W.; Suttiarporn, P.; Wongpornchai, S., The chemical composition and antioxidant activities of Basil from Thailand using retention indices and comprehensive two-dimensional gas chromatography, J. Seb. Chem. Soc., 2010, 75, 11, 1503-1513, https://doi.org/10.2298/JSC100203125P . [all data]

Radulovic, Blagojevic, et al., 2010
Radulovic, N.; Blagojevic, P.; Palic, R., Comparative study of the leaf volatiles of Arctostaphylos uva-ursi (L.) Spreng. and Vaccinium vitis-idaea L. (Ericaceae), Molecules, 2010, 15, 9, 6168-6185, https://doi.org/10.3390/molecules15096168 . [all data]

Radulovic, Dordevic, et al., 2010
Radulovic, N.; Dordevic, N.; Markovic, M.; Palic, R., Volatile constituents of Glechoma Hirsuta Waldst. Kit. and G. Hederacea L. (Lamiaceae), Bull. Chem. Soc. Ethiop., 2010, 24, 1, 67-76, https://doi.org/10.4314/bcse.v24i1.52962 . [all data]

Forero, Quijano, et al., 2008
Forero, M.D.; Quijano, C.E.; Pino, J.A., Volatile compounds of Chile pepper (Capsicum annuum L. var. glabriusculum) at two ripening stages, Flavour Fragr. J., 2008, 24, 1, 25-30, https://doi.org/10.1002/ffj.1913 . [all data]

Kumazawa, Itobe, et al., 2008
Kumazawa, K.; Itobe, T.; Nishimura, O.; Hamaguchi, T., A new approach to estimate the in-mouth release characteristics of odorants in chewing gum, Food Science and Technology Research, 2008, 14, 3, 269-276, https://doi.org/10.3136/fstr.14.269 . [all data]

Mildner-Szkudlarz and Jelen, 2008
Mildner-Szkudlarz, S.; Jelen, H.H., The potential of different techniques for volatile compounds analysis coupled with PCA for the detection of the adulteration of olive oil with hazelnut oil, Food Chem., 2008, 110, 3, 751-761, https://doi.org/10.1016/j.foodchem.2008.02.053 . [all data]

Ferhat, Tigrine-Kordjani, et al., 2007
Ferhat, M.A.; Tigrine-Kordjani, N.; Chemat, S.; Meklati, B.Y.; Chemat, F., Rapid Extraction of Volatile Compounds Using a New Simultaneous Microwave Distillation: Solvent Extraction Device, Chromatographia, 2007, 65, 3-4, 217-222, https://doi.org/10.1365/s10337-006-0130-5 . [all data]

Tava, Pecetti, et al., 2007
Tava, A.; Pecetti, L.; Ricci, M.; Pagnotta, M.A.; Russi, L., Volatile compounds from leaves and flowers of Bituminaria bituminosa (L.) Stirt. (Fabaceae) from Italy, Flavour Fragr. J., 2007, 22, 5, 363-370, https://doi.org/10.1002/ffj.1806 . [all data]

Berlioz, Cordella, et al., 2006
Berlioz, B.; Cordella, C.; Cavalli, J.-F.; Lizzani-Cuvelier, L.; Loiseau, A.-M.; Fernandez, X., Comparison of the amounts of volatile compounds in French protected designation of origin virgin olive oils, J. Agric. Food Chem., 2006, 54, 26, 10092-10101, https://doi.org/10.1021/jf061796+ . [all data]

Figuérédo, Cabassu, et al., 2006
Figuérédo, G.; Cabassu, P.; Chalchat, J.-C.; Pasquier, B., Studies of Mediterranean oregano populations. VIII. Chemical composition of essential oils of oreganos of various origins, Flavour Fragr. J., 2006, 21, 1, 134-139, https://doi.org/10.1002/ffj.1543 . [all data]

Pino, Sauri-Duch, et al., 2006
Pino, J.; Sauri-Duch, E.; Marbot, R., Changes in volatile compounds of Habanero chile pepper (Capsicum chinense Jack. cv. Habanero) at two ripening stages, Food Chem., 2006, 94, 3, 394-398, https://doi.org/10.1016/j.foodchem.2004.11.040 . [all data]

Tigrine-Kordiani, Meklati, et al., 2006
Tigrine-Kordiani, N.; Meklati, B.Y.; Chemat, F., Abalysis by gas chromatography - mass spectrometry of the essential oil of Zygophyllum album L., an aromatic and medicinal plant growing in Algeria, Int. J. Aromatherapy, 2006, 16, 3-4, 187-191, https://doi.org/10.1016/j.ijat.2006.09.008 . [all data]

Holland, Larkov, et al., 2005
Holland, D.; Larkov, O.; Bar-Ya'akov, I.; Bar, E.; Zax, A.; Brandeis, E.; Ravid, U.; Lewinsohn, E., Developmental and varietal differences in volatile ester formation and acetyl-CoA: alcohol acetyl transferase activities in apple (Malus domestica Borkh.) fruit, J. Agric. Food Chem., 2005, 53, 18, 7198-7203, https://doi.org/10.1021/jf050519k . [all data]

Jirovetz, Buchbauer, et al., 2005
Jirovetz, L.; Buchbauer, G.; Stoyanova, A.; Georgiev, E.V.; Damianova, S.T., Composition, quality control and antimicrobial activity of the essential oil of cumin (Cuminum cyminumL.) seeds from Bulgaria that had been stored for up to 36 years, Int. J. Food Sci. Technol., 2005, 40, 3, 305-310, https://doi.org/10.1111/j.1365-2621.2004.00915.x . [all data]

Kalua, Allen, et al., 2005
Kalua, C.M.; Allen, M.S.; Bedgood, D.R., Jr.; Bishop, A.G.; Prenzler, P.D., Discrimination of Olive Oils and Fruits into Cultivars and Maturity Stages Based on Phenolic and Volatile Compounds, J. Agric. Food Chem., 2005, 53, 20, 8054-8062, https://doi.org/10.1021/jf051233i . [all data]

Nyegue, Belinga-Ndoye, et al., 2005
Nyegue, M.A.; Belinga-Ndoye, C.F.; Amvam Zollo, P.H.; Agnaniet, H.; Menut, C.; Bessière, J.M., Aromatic plants of tropical central Africa. Part L. Volatile components of Clerodendrum buchholzii Gürke from Cameroon, Flavour Fragr. J., 2005, 20, 3, 321-323, https://doi.org/10.1002/ffj.1424 . [all data]

Setzer, Noletto, et al., 2005
Setzer, W.N.; Noletto, J.A.; Lawton, R.O.; Haber, W.A., Leaf essential oil composition of five Zanthoxylum species from Monteverde, Costa Rica, Molecular Diversity, 2005, 9, 1-3, 3-13, https://doi.org/10.1007/s11030-005-1298-6 . [all data]

Cavalli, Fernandez, et al., 2004
Cavalli, J.-F.; Fernandez, X.; Lizzani-Cievelier, L.; Loiseau, A.-M., Characterization of volatile compounds of French and Spanish virgin olive oil by HS-SPME: identification of quality-freshness markers, Food Chem., 2004, 88, 1, 151-157, https://doi.org/10.1016/j.foodchem.2004.04.003 . [all data]

Kilic, Hafizoglu, et al., 2004
Kilic, A.; Hafizoglu, H.; Kollmannsberger, H.; Nitz, S., Volatile constituents and key odorants in leaves, buds, flowers, and fruits of Laurus nobilis L., J. Agric. Food Chem., 2004, 52, 6, 1601-1606, https://doi.org/10.1021/jf0306237 . [all data]

Azodanlou, Darbellay, et al., 2003
Azodanlou, R.; Darbellay, C.; Luisier, J.-L.; Villettaz, J.-C.; Amadò, R., Quality assessment of strawberries (Fragaria species), J. Agric. Food Chem., 2003, 51, 3, 715-721, https://doi.org/10.1021/jf0200467 . [all data]

Jirovetz, Buchbauer, et al., 2003
Jirovetz, L.; Buchbauer, G.; Shafi, M.P.; Kaniampady, M.M., Chemotaxonomical analysis of the essential oil aroma compounds of four different Ocimumspecies from southern India, Eur. Food Res. Technol., 2003, 217, 2, 120-124, https://doi.org/10.1007/s00217-003-0708-1 . [all data]

Jirovetz, Buchbauer, et al., 2003, 2
Jirovetz, L.; Buchbauer, G.; Stoyanova, A.S.; Georgiev, E.V.; Damianova, S.T., Composition, quality control, and antimicrobial activity of the essential oil of long-time stored dill (Anethum graveolens L.) seeds from Bulgaria, J. Agric. Food Chem., 2003, 51, 13, 3854-3857, https://doi.org/10.1021/jf030004y . [all data]

Jirovetz, Buchbauer, et al., 2003, 3
Jirovetz, L.; Buchbauer, G.; Shafi, M.P.; Leela, N.K., Analysis of the essential oils of the leaves, stems, rhizomes and roots of the medicinal plant Alpinia galanga from southern India, Acta Pharm. Hung., 2003, 53, 73-81. [all data]

Kanjilal, Kotoky, et al., 2003
Kanjilal, P.B.; Kotoky, R.; Singh, R.S., Chemical composition of the leaf oil of Altingia excelsa Nornha, Flavour Fragr. J., 2003, 18, 5, 449-450, https://doi.org/10.1002/ffj.1250 . [all data]

Mildner-Szkudlarz, Jelen, et al., 2003
Mildner-Szkudlarz, S.; Jelen, H.H.; Zawirska-Wojtasiak, R.; Wasowicz, E., Application of headspace - solid phase microextraction and multivariate analysis for plant oils differentiation, Food Chem., 2003, 83, 4, 515-522, https://doi.org/10.1016/S0308-8146(03)00147-X . [all data]

Valette, Fernandez, et al., 2003
Valette, L.; Fernandez, X.; Poulain, S.; Loiseau, A.-M.; Lizzani-Cuvelier, L.; Levieil, R.; Restier, L., Volatile constituents from Romanesco cauliflower, Food Chem., 2003, 80, 3, 353-358, https://doi.org/10.1016/S0308-8146(02)00272-8 . [all data]

Vichi, Castellote, et al., 2003
Vichi, S.; Castellote, A.I.; Pizzale, L.; Conte, L.S.; Buxaderas, S.; López-Tamames, E., Analysis of virgin olive oil volatile compounds by headspace solid-phase microextraction coupled to gas chromatography with mass spectrometric and flame ionization detection, J. Chromatogr. A, 2003, 983, 1-2, 19-33, https://doi.org/10.1016/S0021-9673(02)01691-6 . [all data]

Vichi, Pizzale, et al., 2003
Vichi, S.; Pizzale, L.; Conte, L.S.; Buxaderas, S.; López-Tamames, E., Solid-phase microextraction in the analysis of virgin olive oil volatile fraction: modifications induced by oxidation and suitable markers of oxidative status, J. Agric. Food Chem., 2003, 51, 22, 6564-6571, https://doi.org/10.1021/jf030268k . [all data]

Vichi, Pizzale, et al., 2003, 2
Vichi, S.; Pizzale, L.; Conte, L.S.; Buxaderas, S.; López-Tamames, E., Solid-phase microextraction in the analysis of virgin olive oil volatile fraction: characterization of virgin olive oils from two distinct geographical areas of Northern Italy, J. Agric. Food Chem., 2003, 51, 22, 6572-6577, https://doi.org/10.1021/jf030269c . [all data]

Bloss, Acree, et al., 2002
Bloss, J.; Acree, T.E.; Bloss, J.M.; Hood, W.R.; Kunz, T.H., Potential use of chemical cues for colony-mate recognition in the big brown bat, Eptesicus fuscus, J. Chem. Ecol., 2002, 28, 4, 819-834, https://doi.org/10.1023/A:1015296928423 . [all data]

Flamini, Ertugrul, et al., 2002
Flamini, G.; Ertugrul, K.; Cioni, P.L.; Morelli, I.; Dural, H.; Bagci, Y., Volatile constituents of two endemic Centaurea species from Turkey: C. pseudoscabiosa subsp. pseudoscabiosa and C. hadimensis, Biochem. Syst. Ecol., 2002, 30, 10, 953-959, https://doi.org/10.1016/S0305-1978(02)00043-1 . [all data]

Jirovetz, Buchbauer, et al., 2002
Jirovetz, L.; Buchbauer, G.; Ngassoum, M.B.; Geissler, M., Aroma compound analysis of Piper nigrum and Piper guineense essential oils from Cameroon using solid-phase microextraction-gas chromatography, solid-phase microextraction-gas chromatography-mass spectrometry and olfactometry, J. Chromatogr. A, 2002, 976, 1-2, 265-275, https://doi.org/10.1016/S0021-9673(02)00376-X . [all data]

Jirovetz, Smith, et al., 2002
Jirovetz, L.; Smith, D.; Buchbauer, G., Aroma compound analysis of Eruca sativa (Brassicaceae) SPME headspace leaf samples using GC, GC-MS, and olfactometry, J. Agric. Food Chem., 2002, 50, 16, 4643-4646, https://doi.org/10.1021/jf020129n . [all data]

Pino, Marbot, et al., 2002
Pino, J.A.; Marbot, R.; Vazquez, C., Characterization of volatiles in Loquat fruit (Eriobotrya japonica Lindl.), Revista CENIC Ciencias Quimicas, 2002, 33, 3, 115-119. [all data]

Campeol, Flamini, et al., 2001
Campeol, E.; Flamini, G.; Chericoni, S.; Catalano, S.; Cremonini, R., Volatile compounds from three cultivars of Olea europaea from Italy, J. Agric. Food Chem., 2001, 49, 11, 5409-5411, https://doi.org/10.1021/jf010455n . [all data]

Tamura, Boonbumrung, et al., 2000
Tamura, H.; Boonbumrung, S.; Yoshizawa, T.; Varanyanond, W., Volatile components of the essential oil in the pulp of four yellow mangoes (Mangifera indica L.) in Thailand, Food Sci. Technol. Res., 2000, 6, 1, 68-73, https://doi.org/10.3136/fstr.6.68 . [all data]

Lopes, Koketsu, et al., 1999
Lopes, D.; Koketsu, M.; Carauta, J.P.P.; de Oliveira, R.R.; Kaplan, M.A.C., Chemical composition of Pourouma guianensis Aublet essential oils, Flavour Fragr. J., 1999, 14, 4, 233-236, https://doi.org/10.1002/(SICI)1099-1026(199907/08)14:4<233::AID-FFJ813>3.0.CO;2-L . [all data]

Ong, Acree, et al., 1998
Ong, P.K.C.; Acree, T.E.; Lavin, E.H., Characterization of volatiles in rambutan fruit (Nephelium lappaceum L.), J. Agric. Food Chem., 1998, 46, 2, 611-615, https://doi.org/10.1021/jf970665t . [all data]

Quiroz A. and Niemeyer H.M., 1998
Quiroz A.; Niemeyer H.M., Olfactometer-assessed responses of aphid Rhopalosiphum padi to wheat and oat volatiles, J. Chem. Ecol., 1998, 24, 1, 113-124, https://doi.org/10.1023/A:1022393029987 . [all data]

Sagrero-Nieves and Bartley, 1996
Sagrero-Nieves, L.; Bartley, J.P., Volatile components from the leaves of heterotheca inuloides Cass., Flavour Fragr. J., 1996, 11, 1, 49-51, https://doi.org/10.1002/(SICI)1099-1026(199601)11:1<49::AID-FFJ538>3.0.CO;2-J . [all data]

Wong and Lai, 1996
Wong, K.C.; Lai, F.Y., Volatile constituents from the fruits of four Syzygium species grown in Malaysia, Flavour Fragr. J., 1996, 11, 1, 61-66, https://doi.org/10.1002/(SICI)1099-1026(199601)11:1<61::AID-FFJ539>3.0.CO;2-1 . [all data]

Chisholm, Guiher, et al., 1995
Chisholm, M.G.; Guiher, L.A.; Zaczkiewicz, S.M., Aroma characteristics of aged Vidal blanc wine, Am. J. Enol. Vitic, 1995, 46, 1, 56-62. [all data]

Gomez and Ledbetter, 1994
Gomez, E.; Ledbetter, C.A., Comparative study of the aromatic profiles of two different plum species: Prunus salicina Lindl and Prunus simonii L., J. Sci. Food Agric., 1994, 65, 1, 111-115, https://doi.org/10.1002/jsfa.2740650116 . [all data]

Shiota, 1993
Shiota, H., New esteric components in the volatiles of banana fruit (Musa sapientum L.), J. Agric. Food Chem., 1993, 41, 11, 2056-2062, https://doi.org/10.1021/jf00035a046 . [all data]

Tamura, Yang, et al., 1993
Tamura, H.; Yang, R.-H.; Sugisawa, H., Aroma profiles of peel oils of acid citrus, ACS Sym. Ser., 1993, 525, 121-136. [all data]

Hansen, Buttery, et al., 1992
Hansen, M.; Buttery, R.G.; Stern, D.J.; Cantwell, M.I.; Ling, L.C., Broccoli storage under low-oxygen atmosphere: Identification of higher boiling volatiles, J. Agric. Food Chem., 1992, 40, 5, 850-852, https://doi.org/10.1021/jf00017a029 . [all data]

Binder, Benson, et al., 1990
Binder, R.G.; Benson, M.E.; Flath, R.A., Volatile Components of Safflower, J. Agric. Food Chem., 1990, 38, 5, 1245-1248, https://doi.org/10.1021/jf00095a020 . [all data]

Binder, Flath, et al., 1989
Binder, R.G.; Flath, R.A.; Mon, T.R., Volatile components of bittermelon, J. Agric. Food Chem., 1989, 37, 2, 418-420, https://doi.org/10.1021/jf00086a032 . [all data]

Sugisawa, Yamamoto, et al., 1989
Sugisawa, H.; Yamamoto, M.; Tamura, H.; Takagi, N., The comparison of volatile components in peel oil from four species of navel orange, Nippon Shokuhin Kogio Gakkaishi, 1989, 36, 6, 455-462, https://doi.org/10.3136/nskkk1962.36.6_455 . [all data]

Wu, Liou, et al., 1987
Wu, C.-M.; Liou, S.-E.; Chang, Y.-H.; Chiang, W., Volatile compounds of the wax gourd (Benincasa hispida, Cogn) and a wax gourd beverage, J. Food Sci., 1987, 52, 1, 132-134, https://doi.org/10.1111/j.1365-2621.1987.tb13988.x . [all data]

Habu, Flath, et al., 1985
Habu, T.; Flath, R.A.; Mon, T.R.; Morton, J.F., Volatile components of Rooibos tea (Aspalathus linearis), J. Agric. Food Chem., 1985, 33, 2, 249-254, https://doi.org/10.1021/jf00062a024 . [all data]