1,1'-Biphenyl, 4,4'-dibromo-

Phase change data

Data compiled as indicated in comments:
BS - Robert L. Brown and Stephen E. Stein
TRC - Thermodynamics Research Center, NIST Boulder Laboratories, Chris Muzny director
AC - William E. Acree, Jr., James S. Chickos

Quantity Value Units Method Reference Comment
Tboil630.7KN/AWeast and Grasselli, 1989BS
Quantity Value Units Method Reference Comment
Tfus442.KN/ASangster and Irvine, 1956Uncertainty assigned by TRC = 3. K; TRC
Tfus437.KN/AHauptmann and Wladislaw, 1950Uncertainty assigned by TRC = 3. K; TRC
Tfus437.KN/AHauptmann and Wladislaw, 1950, 2Uncertainty assigned by TRC = 3. K; TRC
Tfus438.KN/AHauptmann and Wladislaw, 1950, 2Uncertainty assigned by TRC = 3. K; TRC
Tfus437.KN/AHauptmann and Wladislaw, 1950, 2Uncertainty assigned by TRC = 3. K; TRC

Enthalpy of fusion

ΔfusH (kJ/mol) Temperature (K) Method Reference Comment
28.38440.7DSCRai and Reddi, 2009AC

In addition to the Thermodynamics Research Center (TRC) data available from this site, much more physical and chemical property data is available from the following TRC products:

References

Weast and Grasselli, 1989
CRC Handbook of Data on Organic Compounds, 2nd Editon, Weast,R.C and Grasselli, J.G., ed(s)., CRC Press, Inc., Boca Raton, FL, 1989, 1. [all data]

Sangster and Irvine, 1956
Sangster, R.C.; Irvine, J.W., Study of Organic Scintillators, J. Chem. Phys., 1956, 24, 670. [all data]

Hauptmann and Wladislaw, 1950
Hauptmann, H.; Wladislaw, B., The Action of Raney Nickel upon Sulfur Compounds II. Mercaptals, Mercaptols and Disulfides, J. Am. Chem. Soc., 1950, 72, 707. [all data]

Hauptmann and Wladislaw, 1950, 2
Hauptmann, H.; Wladislaw, B., The Action of Raney Nickel on SUlfur Compounds III. Aromatic Thioesters, J. Am. Chem. Soc., 1950, 72, 710. [all data]

Rai and Reddi, 2009
Rai, R.N.; Reddi, R.S.B., Thermal, solid--liquid equilibrium, crystallization, and microstructural studies of organic monotectic alloy: 4,4´-Dibromobiphenyl--succinonitrile, Thermochimica Acta, 2009, 496, 1-2, 13-17, https://doi.org/10.1016/j.tca.2009.06.012 . [all data]