Perfluoro-2,4,6,8,11,13,15.17-octaoxy-n-octadecane

Phase change data

Data compiled by: William E. Acree, Jr., James S. Chickos

Quantity Value Units Method Reference Comment
Δvap14.8 ± 0.29kcal/molEBDruzhinina, Krol', et al., 2006Based on data from 363. - 437. K.

References

Druzhinina, Krol', et al., 2006
Druzhinina, A.I.; Krol', O.V.; Efimova, A.A.; Varushchenko, R.M.; Gervits, L.L., The temperature dependences of saturated vapor pressures and heat capacities of some perfluoropolyethers, Russ. J. Phys. Chem., 2006, 80, 11, 1742-1748, https://doi.org/10.1134/S0036024406110082 . [all data]