ethyl [2]alcohol

Phase change data

Data compiled by: Thermodynamics Research Center, NIST Boulder Laboratories, Chris Muzny director

Quantity Value Units Method Reference Comment
Ttriple156.9KN/ANikolaev, Rabinovich, et al., 1967Crystal phase 1 phase; Uncertainty assigned by TRC = 0.1 K

In addition to the Thermodynamics Research Center (TRC) data available from this site, much more physical and chemical property data is available from the following TRC products:

Gas phase ion energetics data

Data compiled as indicated in comments:
RDSH - Henry M. Rosenstock, Keith Draxl, Bruce W. Steiner, and John T. Herron
LBLHLM - Sharon G. Lias, John E. Bartmess, Joel F. Liebman, John L. Holmes, Rhoda D. Levin, and W. Gary Mallard

Ionization energy determinations

IE (eV) Method Reference Comment
10.49PIPotapov and Sorokin, 1970RDSH

Appearance energy determinations

Ion AE (eV) Other Products MethodReferenceComment
CH2D+16.7 ± 0.3H+H2+COEIBurgers, Holmes, et al., 1983LBLHLM
CH2DO+11.2CH3PIPotapov and Sorokin, 1970RDSH
C2H4DO+10.8HPIPotapov and Sorokin, 1970RDSH

References

Nikolaev, Rabinovich, et al., 1967
Nikolaev, P.N.; Rabinovich, I.B.; Lebedev, B.V., Heat Capacity of Ethanol and Deuiteioethanol in the Range 80-250 K, Zh. Fiz. Khim., 1967, 41, 1294-9. [all data]

Potapov and Sorokin, 1970
Potapov, V.K.; Sorokin, V.V., Investigation of ionic molecular reactions proceeding during photoionization of aromatic compounds and alcohols, Dokl. Akad. Nauk SSSR, 1970, 195, 616, In original 848. [all data]

Burgers, Holmes, et al., 1983
Burgers, P.C.; Holmes, J.L.; Szulejko, J.E.; Mommers, A.A.; Terlouw, J.K., The gas phase ion chemistry of the acetyl cation and isomeric [C2H3O]+ ions. On the structure of the [C2H3O]+ daughter ions generated from the enol of acetone radical cation, Org. Mass Spectrom., 1983, 18, 254. [all data]