1-Propene-1-thiol

Van Den Dool and Kratz RI, non-polar column, temperature ramp

Data compiled by: NIST Mass Spectrometry Data Center, William E. Wallace, director

Column type CapillaryCapillaryCapillary
Active phase Ultra-1Ultra-1HP-1
Column length (m) 25.25.50.
Carrier gas H2H2He
Substrate
Column diameter (mm) 0.20.20.32
Phase thickness (μm) 0.330.331.05
Tstart (C) 60.60.40.
Tend (C) 230.230.260.
Heat rate (K/min) 2.2.2.
Initial hold (min)
Final hold (min)
I 600.0603.4595.
ReferenceFarkas, Hradský, et al., 1992Farkas, Hradský, et al., 1992Kuo and Ho, 1992
Comment MSDC-RI MSDC-RI MSDC-RI

References

Farkas, Hradský, et al., 1992
Farkas, P.; Hradský, P.; Kovác, M., Novel flavour components identified in the steamn distillate of onion (Allium cepa L.), Z. Lebensm. Unters. Forsch., 1992, 195, 5, 459-462, https://doi.org/10.1007/BF01191718 . [all data]

Kuo and Ho, 1992
Kuo, M.-C.; Ho, C.-T., Volatile constituents of the distilled oils of Welsh onions (Allium fistulosum L. variety Maichuon) and scallions (Allium fistulosum L. variety Caespitosum), J. Agric. Food Chem., 1992, 40, 1, 111-117, https://doi.org/10.1021/jf00013a021 . [all data]