1,3,6-Heptatriene, 5-methyl-

Gas phase ion energetics data

Data compiled as indicated in comments:
LBLHLM - Sharon G. Lias, John E. Bartmess, Joel F. Liebman, John L. Holmes, Rhoda D. Levin, and W. Gary Mallard

Ionization energy determinations

IE (eV) Method Reference Comment
8.4 ± 0.1EIGroenwold and Gross, 1984LBLHLM

Appearance energy determinations

Ion AE (eV) Other Products MethodReferenceComment
C7H9+8.8 ± 0.1CH3EIGroenwold and Gross, 1984LBLHLM

Normal alkane RI, polar column, custom temperature program

View large format table.

Column type Active phase I Reference Comment
CapillaryBP-201549.Pontes, Marques, et al., 200730. m/0.25 mm/0.25 μm, He; Program: 50C(1min) => 2.5C/min => 100C => 2C/min => 180C => 15C/min => 220C

References

Groenwold and Gross, 1984
Groenwold, G.S.; Gross, M.L., Cation radical diels-alder reaction of 1,3-butadiene: A two-step cycloaddition, J. Am. Chem. Soc., 1984, 106, 6569. [all data]

Pontes, Marques, et al., 2007
Pontes, M.; Marques, J.C.; Camara, J.S., Screening of volatile composition from Portuguese multifloral honeys using headspace solid-phase microextraction-gas chromatography-quadrupole mass spectrometry, Talanta, 2007, 74, 1, 91-103, https://doi.org/10.1016/j.talanta.2007.05.037 . [all data]