Butanedioic acid, bis(2-methylpropyl) ester

Normal alkane RI, non-polar column, temperature ramp

Data compiled by: NIST Mass Spectrometry Data Center, William E. Wallace, director

Column type Capillary
Active phase Ultra-1
Column length (m) 25.
Carrier gas He
Substrate
Column diameter (mm) 0.32
Phase thickness (μm) 0.25
Tstart (C) 80.
Tend (C) 260.
Heat rate (K/min) 3.
Initial hold (min)
Final hold (min)
I 1447.
ReferenceOkumura, 1991
Comment MSDC-RI

Normal alkane RI, non-polar column, isothermal

View large format table.

Column type Active phase Temperature (C) I Reference Comment
CapillaryOV-101150.1452.Lipp, Krasnykh, et al., 2008Helium; Column length: 50. m; Column diameter: 0.25 mm
CapillaryOV-101160.1451.Lipp, Krasnykh, et al., 2008Helium; Column length: 50. m; Column diameter: 0.25 mm
CapillaryOV-101170.1451.Lipp, Krasnykh, et al., 2008Helium; Column length: 50. m; Column diameter: 0.25 mm
CapillaryOV-101180.1450.Lipp, Krasnykh, et al., 2008Helium; Column length: 50. m; Column diameter: 0.25 mm

References

Okumura, 1991
Okumura, T., retention indices of environmental chemicals on methyl silicone capillary column, Journal of Environmental Chemistry (Japan), 1991, 1, 2, 333-358, https://doi.org/10.5985/jec.1.333 . [all data]