2H-1-Benzopyran-2-one, 3,4-dihydro-6-methyl-

Normal alkane RI, non-polar column, custom temperature program

View large format table.

Column type Active phase I Reference Comment
CapillaryHP-5 MS1369.Wang, Xu, et al., 201130. m/0.25 mm/0.25 μm, Helium; Program: 50 0C (1.5 min) 10 0C/min -> 180 0C (2 min) 6 0C/min -> 280 0C (10 min)

References

Wang, Xu, et al., 2011
Wang, J.; Xu, L.; Yang, L.; Liu, Z.; Zhou, L., Composition, antibacterial and antioxidant activities of essential oils from Ligusticum sinense and L. jaholense (Unvelliferae) from China, Rec. Nat. Prod., 2011, 5, 4, 314-318. [all data]