2-Butenoic acid, 3-methyl-, methyl ester

Van Den Dool and Kratz RI, polar column, custom temperature program

Data compiled by: NIST Mass Spectrometry Data Center, William E. Wallace, director

Column type Capillary
Active phase DB-FFAP
Column length (m) 30.
Carrier gas
Substrate
Column diameter (mm) 0.32
Phase thickness (μm) 0.25
Program 40C(2min) => 40C/min => 60C (2min) => 6C/min => 180C => 10C/min => 240C (5min)
I 1162.
ReferenceMunk, Munch, et al., 2000
Comment MSDC-RI

Phase change data

Data compiled by: William E. Acree, Jr., James S. Chickos

Quantity Value Units Method Reference Comment
Δvap46.9 ± 0.2kJ/molGSEmel'yanenko, Toktonov, et al., 2008Based on data from 274. - 304. K.

Van Den Dool and Kratz RI, polar column, temperature ramp

Data compiled by: NIST Mass Spectrometry Data Center, William E. Wallace, director

Column type Capillary
Active phase AT-Wax
Column length (m) 60.
Carrier gas He
Substrate
Column diameter (mm) 0.32
Phase thickness (μm) 0.25
Tstart (C) 65.
Tend (C) 250.
Heat rate (K/min) 2.
Initial hold (min) 10.
Final hold (min) 60.
I 1155.
ReferencePino, Almora, et al., 2003
Comment MSDC-RI

References

Munk, Munch, et al., 2000
Munk, S.; Munch, P.; Stahnke, L.; Adler-Nissen., J.; Schieberle, P., Primary odorants of laundry soiled with sweat/sebum: influence of lipase on the odor profile, Journal of Surfactants and Detergents, 2000, 3, 4, 505-515, https://doi.org/10.1007/s11743-000-0150-z . [all data]