2,3-Naphthalenediol

Gas phase thermochemistry data

Data compiled by: Hussein Y. Afeefy, Joel F. Liebman, and Stephen E. Stein

Quantity Value Units Method Reference Comment
Δfgas-192.8 ± 2.0kJ/molCcbRibeiro Da Silva, Ribeiro Da Silva, et al., 1988
Δfgas-207.0 ± 1.6kJ/molCcbColomina, Jimenez, et al., 1979see Colomina, Roux, et al., 1976

Condensed phase thermochemistry data

Data compiled as indicated in comments:
ALS - Hussein Y. Afeefy, Joel F. Liebman, and Stephen E. Stein
DH - Eugene S. Domalski and Elizabeth D. Hearing

Quantity Value Units Method Reference Comment
Δfsolid-302.4 ± 1.7kJ/molCcbRibeiro Da Silva, Ribeiro Da Silva, et al., 1988ALS
Δfsolid-316.4 ± 1.5kJ/molCcbColomina, Jimenez, et al., 1979see Colomina, Roux, et al., 1976; ALS
Quantity Value Units Method Reference Comment
Δcsolid-4776.0 ± 1.1kJ/molCcbRibeiro Da Silva, Ribeiro Da Silva, et al., 1988Corresponding Δfsolid = -302.4 kJ/mol (simple calculation by NIST; no Washburn corrections); ALS
Δcsolid-4761.97 ± 0.67kJ/molCcbColomina, Jimenez, et al., 1979see Colomina, Roux, et al., 1976; Corresponding Δfsolid = -316.45 kJ/mol (simple calculation by NIST; no Washburn corrections); ALS
Quantity Value Units Method Reference Comment
solid,1 bar192.0J/mol*KN/ADanilenko, Danilenko, et al., 1974DH

Phase change data

Data compiled as indicated in comments:
ALS - Hussein Y. Afeefy, Joel F. Liebman, and Stephen E. Stein
DRB - Donald R. Burgess, Jr.
AC - William E. Acree, Jr., James S. Chickos

Quantity Value Units Method Reference Comment
Δsub109.6 ± 1.0kJ/molCRibeiro Da Silva, Ribeiro Da Silva, et al., 1988ALS
Δsub109.6kJ/molN/ARibeiro Da Silva, Ribeiro Da Silva, et al., 1988DRB
Δsub109.6 ± 1.0kJ/molCRibeiro Da Silva, Ribeiro Da Silva, et al., 1988AC
Δsub109.4 ± 0.5kJ/molVColomina, Jimenez, et al., 1979see Colomina, Roux, et al., 1976; ALS
Δsub109.4kJ/molN/AColomina, Jimenez, et al., 1979DRB

Enthalpy of sublimation

ΔsubH (kJ/mol) Temperature (K) Method Reference Comment
109.4 ± 0.5350.MEColomina, Jimenez, et al., 1979, 2Based on data from 341. - 359. K.; AC

References

Ribeiro Da Silva, Ribeiro Da Silva, et al., 1988
Ribeiro Da Silva, M.A.V.; Ribeiro Da Silva, M.D.M.C.; Pilcher, G., Enthalpies of combustion of 1-hydroxynaphthalene, 2-hydroxynaphthalene, and 1,2-, 1,3-, 1,4-, and 2,3-dihydroxynaphthalenes, J. Chem. Thermodyn., 1988, 20, 969-974. [all data]

Colomina, Jimenez, et al., 1979
Colomina, M.; Jimenez, P.; Roux, M.V.; Turrion, C., Thermochemical properties of naphthalene derivatives. V. Formation enthalpies of 2,3-dimethylnaphthalene and 2,3-dihydroxynaphthalene, An. Quim., 1979, 75, 620-624. [all data]

Colomina, Roux, et al., 1976
Colomina, M.; Roux, M.V.; Turrion, C., Thermochemical properties of naphthalene compounds. IV. Enthalpies of combustion and formation of 2-methoxynaphthalene, 2-ethoxynaphthalene, and 2,3- and 2,7-dihydroxynaphthalenes, J. Chem. Thermodyn., 1976, 8, 869-872. [all data]

Danilenko, Danilenko, et al., 1974
Danilenko, V.E.; Danilenko, G.N.; Demidenko, A.F., Thermodynamic properties of β-naphthol and 2,3-dihydroxynaphthalene, Zhur. Fiz. Khim., 1974, 48, 1886. [all data]

Colomina, Jimenez, et al., 1979, 2
Colomina, M.; Jimenez, P.; Roux, M.V.; Turrion, C., An. Quim., 1979, 75, 620. [all data]