4,4'-Didecanoyloxydiphenyldiacetylene

Phase change data

Data compiled as indicated in comments:
AC - William E. Acree, Jr., James S. Chickos
DH - Eugene S. Domalski and Elizabeth D. Hearing

Enthalpy of fusion

ΔfusH (kJ/mol) Temperature (K) Reference Comment
42.2403.Domalski and Hearing, 1996AC

Enthalpy of phase transition

ΔHtrs (kJ/mol) Temperature (K) Initial Phase Final Phase Reference Comment
44.900308.crystaline, IIcrystaline, IOzcayir, Asrar, et al., 1984DH
42.200403.crystaline, IliquidOzcayir, Asrar, et al., 1984DH

Entropy of phase transition

ΔStrs (J/mol*K) Temperature (K) Initial Phase Final Phase Reference Comment
122.1308.crystaline, IIcrystaline, IOzcayir, Asrar, et al., 1984DH
104.6403.crystaline, I, Solidliquid, isotropicOzcayir, Asrar, et al., 1984DH

References

Domalski and Hearing, 1996
Domalski, Eugene S.; Hearing, Elizabeth D., Heat Capacities and Entropies of Organic Compounds in the Condensed Phase. Volume III, J. Phys. Chem. Ref. Data, 1996, 25, 1, 1, https://doi.org/10.1063/1.555985 . [all data]

Ozcayir, Asrar, et al., 1984
Ozcayir, Y.; Asrar, J.; Blumstein, A., Diacetylenic liquid crystals: a systematic investigation of the homologous series of 4,4'-dialkanoyloxydiphenyldiacetylenes, Mol. Cryst. Liq. Cryst., 1984, 110, 263-276. [all data]