2-Ethylacrolein

Gas phase thermochemistry data

Data compiled by: Hussein Y. Afeefy, Joel F. Liebman, and Stephen E. Stein

Quantity Value Units Method Reference Comment
Δfgas-131.2 ± 2.6kJ/molCcbVan-chin-syan, Kochubei, et al., 1996

Condensed phase thermochemistry data

Data compiled by: Hussein Y. Afeefy, Joel F. Liebman, and Stephen E. Stein

Quantity Value Units Method Reference Comment
Δfliquid-168.0 ± 2.6kJ/molCcbVan-chin-syan, Kochubei, et al., 1996
Quantity Value Units Method Reference Comment
Δcliquid-2946.6 ± 2.5kJ/molCcbVan-chin-syan, Kochubei, et al., 1996Corresponding Δfliquid = -164.3 kJ/mol (simple calculation by NIST; no Washburn corrections)

Phase change data

Data compiled as indicated in comments:
BS - Robert L. Brown and Stephen E. Stein
ALS - Hussein Y. Afeefy, Joel F. Liebman, and Stephen E. Stein
DRB - Donald R. Burgess, Jr.
AC - William E. Acree, Jr., James S. Chickos

Quantity Value Units Method Reference Comment
Tboil365.7KN/AAldrich Chemical Company Inc., 1990BS
Quantity Value Units Method Reference Comment
Δvap36.81 ± 0.41kJ/molCVan-chin-syan, Kochubei, et al., 1996ALS
Δvap36.8kJ/molN/AVan-chin-syan, Kochubei, et al., 1996DRB
Δvap36.8 ± 0.4kJ/molCVan-Chin-Syan, Kochubei, et al., 1996AC

Normal alkane RI, polar column, temperature ramp

View large format table.

Column type Active phase I Reference Comment
CapillaryHP-Innowax974.Feng, Zhuang, et al., 201160. m/0.25 mm/0.25 μm, Helium, 60. C @ 1. min, 3. K/min, 220. C @ 5. min

Normal alkane RI, polar column, custom temperature program

View large format table.

Column type Active phase I Reference Comment
CapillaryHP-Innowax957.Feng, Zhuang, et al., 201160. m/0.25 mm/0.25 μm, Helium; Program: not specified

References

Van-chin-syan, Kochubei, et al., 1996
Van-chin-syan, Yu.Ya.; Kochubei, V.V.; Sergeev, V.V.; Raevskii, Yu.A.; Gerasimchuk, S.I.; Kotovich, Kh.Z., Thermodynamic properties of some acids and aldehydes of the acrylic series, Sov. J. Chem. Phys. (Engl. Transl.), 1996, 70, 1789-1794, In original 1932. [all data]

Aldrich Chemical Company Inc., 1990
Aldrich Chemical Company Inc., Catalog Handbook of Fine Chemicals, Aldrich Chemical Company, Inc., Milwaukee WI, 1990, 1. [all data]

Van-Chin-Syan, Kochubei, et al., 1996
Van-Chin-Syan, Yu.Ya.; Kochubei, V.V.; Sergeev, V.V.; Raevskii, Yu.A.; Gerasimchuk, S.I.; Kotovich, Kh.Z., Thermodynamic properties of some acrylic-series acids and aldehydes, Zh. Fiz. Khim., 1996, 70, 11, 1932. [all data]