Cesium metaborate

Gas phase ion energetics data

Data compiled by: Sharon G. Lias, John E. Bartmess, Joel F. Liebman, John L. Holmes, Rhoda D. Levin, and W. Gary Mallard

Ionization energy determinations

IE (eV) Method Reference
8.6 ± 0.5EIAsano, Yasue, et al., 1984

Appearance energy determinations

Ion AE (eV) Other Products MethodReferenceComment
B+24.5 ± 0.5CsO+OEIAsano, Yasue, et al., 1984
BCs+23.0 ± 0.52O/O2EIAsano, Yasue, et al., 1984
BCsO+14.0 ± 0.5OEIAsano, Yasue, et al., 1984
Cs+3.9 ± 1.0BO2-EIAsano, Yasue, et al., 1984
Cs+9.1 ± 0.5BO2EIAsano, Yasue, et al., 1984
CsO+14.8 ± 0.5BOEIAsano, Yasue, et al., 1984

References

Asano, Yasue, et al., 1984
Asano, M.; Yasue, Y.; Kubo, K., Mass spectrometric study of ions formed from cesium metaborate vapor under electron impact, J. Nucl. Sci. Technol., 1984, 21, 614. [all data]