Phenyltoloxamine

Normal alkane RI, non-polar column, custom temperature program

Data compiled by: NIST Mass Spectrometry Data Center, William E. Wallace, director

Column type CapillaryCapillaryOther
Active phase OV-1OV-1, SE-30, Methyl silicone, SP-2100, OV-101, DB-1, etc.Methyl Silicone
Column length (m) 50.50.
Carrier gas HydrogenHydrogen
Substrate
Column diameter (mm) 0.320.32
Phase thickness (μm)
Program not specifiednot specifiednot specified
I 1915.1915.1938.
ReferenceWaggott and Davies, 1984Waggott and Davies, 1984Ardrey and Moffat, 1981
Comment MSDC-RI MSDC-RI MSDC-RI

References

Waggott and Davies, 1984
Waggott, A.; Davies, I.W., Identification of organic pollutants using linear temperature programmed retention indices (LTPRIs) - Part II, 1984, retrieved from http://dwi.defra.gov.uk/research/completed-research/reports/dwi0383.pdf. [all data]

Ardrey and Moffat, 1981
Ardrey, R.E.; Moffat, A.C., Gas-liquid chromatographic retention indices of 1318 substances of toxicological interest on SE-30 or OV-1 stationary phase, J. Chromatogr., 1981, 220, 3, 195-252, https://doi.org/10.1016/S0021-9673(00)81925-1 . [all data]