[2H]formic [2]acid

Vibrational and/or electronic energy levels

Data compiled by: Takehiko Shimanouchi

Symmetry:   Cs     Symmetry Number σ = 1

 Sym.   No   Approximate   Selected Freq.  Infrared   Raman   Comments
 Species   type of mode   Value   Rating   Value  Phase  Value  Phase

a' 1 OD str 2632  C 2632 W gas
a' 2 CD str 2232  C 2231.8 M gas
a' 3 C=O str 1742  C 1742 VS gas
a' 4 CD bend 945  C 945 M gas
a' 5 OD bend 1040  C 1040 W gas
a' 6 C-O str 1171  C 1171.3 S gas
a' 7 OCO deform 558  C 558 W gas
a 8 CD bend 873  C 873 W gas
a 9 Torsion 491  C 491 W gas

Source: Shimanouchi, 1972

References

Shimanouchi, 1972
Shimanouchi, T., Tables of Molecular Vibrational Frequencies Consolidated Volume I, National Bureau of Standards, 1972, 1-160. [all data]