4-(Dimethylamino)fluorene

Gas phase ion energetics data

Data compiled as indicated in comments:
LBLHLM - Sharon G. Lias, John E. Bartmess, Joel F. Liebman, John L. Holmes, Rhoda D. Levin, and W. Gary Mallard

Ionization energy determinations

IE (eV) Method Reference Comment
7.1PEGleiter, Schafer, et al., 1984LBLHLM
7.5PEGleiter, Schafer, et al., 1984Vertical value; LBLHLM

References

Gleiter, Schafer, et al., 1984
Gleiter, R.; Schafer, W.; Staab, H.A.; Saupe, T., Electronic structure of 4,5-bis(dimethylamine)fluorene. PE spectroscopic investigations, J. Org. Chem., 1984, 49, 4463. [all data]