α-n-Propyldecalin

Condensed phase thermochemistry data

Data compiled by: Eugene S. Domalski and Elizabeth D. Hearing

Constant pressure heat capacity of liquid

Cp,liquid (J/mol*K) Temperature (K) Reference Comment
337.2313.Gudinowicz, Campbell, et al., 1963T = 313 to 483 K.
335.6311.Gollis, Belenyessy, et al., 1962Temperatures 100, 200, 300°F.

References

Gudinowicz, Campbell, et al., 1963
Gudinowicz, B.J.; Campbell, R.H.; Adams, J.S., Specific heat measurements of complex saturated hydrocarbons, J. Chem. Eng. Data, 1963, 8, 201-214. [all data]

Gollis, Belenyessy, et al., 1962
Gollis, M.H.; Belenyessy, L.I.; Gudzinowicz, B.J.; Koch, S.D.; Smith, J.O.; Wineman, R.J., Evaluations of pure hydrocarbons as Jet Fuels, J. Chem. Eng. Data, 1962, 7, 311-316. [all data]