[1,1'-Biphenyl]-4,4'-diamine, 3,3'-dichloro-

Van Den Dool and Kratz RI, non-polar column, temperature ramp

View large format table.

Column type Active phase I Reference Comment
CapillaryUltra-12416.64Richmond and Pombo-Villar, 199725. m/0.32 mm/0.52 μm, 15. K/min, 320. C @ 10. min; Tstart: 35. C

Normal alkane RI, non-polar column, temperature ramp

View large format table.

Column type Active phase I Reference Comment
CapillarySE-542463.Harland, Cumming, et al., 1986He, 50. C @ 2. min, 8. K/min, 250. C @ 12. min; Column length: 25. m; Column diameter: 0.32 mm

Lee's RI, non-polar column, temperature ramp

View large format table.

Column type Active phase I Reference Comment
CapillaryDB-5395.3Donnelly, Abdel-Hamid, et al., 199330. m/0.32 mm/0.25 μm, He, 40. C @ 3. min, 8. K/min, 285. C @ 29.5 min

References

Bilbo and Wyman, 1953
Bilbo, A.J.; Wyman, G.M., Steric hindrance to coplanarity in o-fluorobenzidines, J. Am. Chem. Soc., 1953, 75, 5312-5314. [all data]

Richmond and Pombo-Villar, 1997
Richmond, R.; Pombo-Villar, E., Short communication. Gas chromatography-mass spectrometry coupled with pseudo-Sadtler retention indices, for the identification of components in the essential oil of Curcuma longa L., J. Chromatogr. A, 1997, 760, 2, 303-308, https://doi.org/10.1016/S0021-9673(96)00802-3 . [all data]

Harland, Cumming, et al., 1986
Harland, B.J.; Cumming, R.I.; Gillings, E., The Kovats indexes of some organic micropollutants on an SE54 capillary column, EUR, I Org. Micropollut. Aquat. Environ., 1986, EUR 10388, 123-127. [all data]

Donnelly, Abdel-Hamid, et al., 1993
Donnelly, J.R.; Abdel-Hamid, M.S.; Jeter, J.L.; Gurka, D.F., Application of gas chromatographic retention properties to the identification of environmental contaminants, J. Chromatogr., 1993, 642, 1-2, 409-415, https://doi.org/10.1016/0021-9673(93)80106-I . [all data]