Ytterbium isothiocyanate hexahydrate

Condensed phase thermochemistry data

Data compiled by: Eugene S. Domalski and Elizabeth D. Hearing

Quantity Value Units Method Reference Comment
solid,1 bar124.73cal/mol*KN/ATan, Matsuo, et al., 1991

Constant pressure heat capacity of solid

Cp,solid (cal/mol*K) Temperature (K) Reference Comment
109.02298.15Tan, Matsuo, et al., 1991T = 13 to 300 K.

References

Tan, Matsuo, et al., 1991
Tan, Z.; Matsuo, T.; Suga, H.; Zhang, Z.; Yin, J.; Jiang, B.; Sun, T., Low-temperature heat capacities and standard thermodynamic functions of rare earth isothiocyanate hydrates, RE(NCS)3xnH2O, Chin. Sci. Bull., 1991, 36(13), 1086-1090. [all data]