α-Campholenal

Normal alkane RI, non-polar column, temperature ramp

Data compiled by: NIST Mass Spectrometry Data Center, William E. Wallace, director

Column type CapillaryCapillaryCapillaryCapillaryCapillary
Active phase DB-5 MSSPB-1HP-5 MSHP-5 MSCP Sil 5 CB
Column length (m) 30.30.30.30.25.
Carrier gas HeliumHeliumHeliumHelium
Substrate
Column diameter (mm) 0.250.200.250.250.25
Phase thickness (μm) 0.250.200.250.250.15
Tstart (C) 60.70.70.70.50.
Tend (C) 270.220.290.290.230.
Heat rate (K/min) 3.3.5.5.3.
Initial hold (min)
Final hold (min)  15.10.10.
I 1134.1103.1130.1130.1124.
ReferenceCui, Yang, et al., 2011Neves, Rosa, et al., 2010Radulovic, Blagojevic, et al., 2010Radulovic, Dordevic, et al., 2010Usman, Zubair, et al., 2010
Comment MSDC-RI MSDC-RI MSDC-RI MSDC-RI MSDC-RI
Column type CapillaryCapillaryCapillaryCapillaryCapillary
Active phase SE-54DB-5DB-5DB-5HP-5 MS
Column length (m) 30.50.30.60.30.
Carrier gas HeliumNitrogenHeliumNitrogenHelium
Substrate
Column diameter (mm) 0.250.200.250.250.25
Phase thickness (μm) 0.250.320.250.250.25
Tstart (C) 60.60.70.60.60.
Tend (C) 260.220.220.250.280.
Heat rate (K/min) 2.5.3.5.3.
Initial hold (min) 5.3.1.
Final hold (min) 999.  10.
I 1123.1125.1111.1132.1127.
ReferenceDayisoylu and Alma, 2009Kazemi and Akhavani, 2009Ali, Wurster, et al., 2008Mosayebi, Amin, et al., 2008Tsokou, Georgopoulos, et al., 2007
Comment MSDC-RI MSDC-RI MSDC-RI MSDC-RI MSDC-RI
Column type Capillary
Active phase DB-5
Column length (m) 30.
Carrier gas Helium
Substrate
Column diameter (mm) 0.25
Phase thickness (μm) 0.25
Tstart (C) 35.
Tend (C) 280.
Heat rate (K/min) 4.
Initial hold (min) 2.
Final hold (min)
I 1130.
ReferenceKowalski, 2005
Comment MSDC-RI

Normal alkane RI, non-polar column, custom temperature program

Data compiled by: NIST Mass Spectrometry Data Center, William E. Wallace, director

Column type CapillaryCapillaryCapillaryCapillaryCapillary
Active phase DB-1Polydimethyl siloxane with 5 % Ph groups HP-5 MSHP-5 MS
Column length (m) 30.30.
Carrier gas HydrogenHelium
Substrate
Column diameter (mm) 0.250.25
Phase thickness (μm) 0.250.25
Program 45 0C 3 0C/min -> 175 0C 15 0C/min -> 300 0C (10 min)50 0C 4 0C/min -> 200 0C (5 min) 20 0C/min -> 280 0Cnot specifiednot specifiednot specified
I 1098.1126.1125.1127.1128.
ReferenceAlbano, Lima, et al., 2012da Silva, de Souza, et al., 2012Karimi, Farmany, et al., 2011Payo, Colo, et al., 2011Payo, Colo, et al., 2011
Comment MSDC-RI MSDC-RI MSDC-RI MSDC-RI MSDC-RI
Column type Capillary
Active phase HP-5 MS
Column length (m)
Carrier gas
Substrate
Column diameter (mm)
Phase thickness (μm)
Program not specified
I 1136.
ReferencePayo, Colo, et al., 2011
Comment MSDC-RI

Normal alkane RI, polar column, temperature ramp

View large format table.

Column type Active phase I Reference Comment
CapillarySupelcowax-101486.Neves, Rosa, et al., 201030. m/0.20 mm/0.20 μm, Helium, 3. K/min, 220. C @ 15. min; Tstart: 70. C

Normal alkane RI, polar column, custom temperature program

View large format table.

Column type Active phase I Reference Comment
CapillaryHP Innowax1489.Noorizadeh and Farmany, 201060. m/0.25 mm/0.33 μm; Program: not specified
CapillaryInnowax FSC1500.Baser, Demirci, et al., 200960. m/0.25 mm/0.25 μm, Helium; Program: 60 0C (10 min) 4 0C/min -> 220 0C (10 min) 1 0C/min -> 240 0C

References

Cui, Yang, et al., 2011
Cui, J.; Yang, X.; Dong, A.-J.; Cheng, D.-Y.; Wang, J.; Zhao, H.-T.; Xu, R.-B.; Wang, P.; Li, W.-J., Chemical composition and antioxidant activity of Wuphorbia fischeriana essential oil from China, J. Med. Plants Res., 2011, 5, 19, 4894-4798. [all data]

Neves, Rosa, et al., 2010
Neves, A.; Rosa, S.; Goncalves, J.; Rufino, A.; Judas, F.; Salgueiro, L.; Lopes, M.C.; Cavaleiro, C.; Mendes, A.F., Screening of five essential oils for identification of potential inhibitors of IL-1-unduced Nf-kB activation and NO production in human clondrocytes: characterization of the inhibitory activity of alpha-pinene, Plante Med., 2010, 76, 03, 303-308, https://doi.org/10.1055/s-0029-1186085 . [all data]

Radulovic, Blagojevic, et al., 2010
Radulovic, N.; Blagojevic, P.; Palic, R., Comparative study of the leaf volatiles of Arctostaphylos uva-ursi (L.) Spreng. and Vaccinium vitis-idaea L. (Ericaceae), Molecules, 2010, 15, 9, 6168-6185, https://doi.org/10.3390/molecules15096168 . [all data]

Radulovic, Dordevic, et al., 2010
Radulovic, N.; Dordevic, N.; Markovic, M.; Palic, R., Volatile constituents of Glechoma Hirsuta Waldst. Kit. and G. Hederacea L. (Lamiaceae), Bull. Chem. Soc. Ethiop., 2010, 24, 1, 67-76, https://doi.org/10.4314/bcse.v24i1.52962 . [all data]

Usman, Zubair, et al., 2010
Usman, L.A.; Zubair, M.F.; Adabayo, S.A.; Oladosu, I.A.; Muhammad, N.O.; Akolade, J.O., Chemical composition of leaf and fruit essential oils of Hoslundia opposita Vahl grown in Nigeria, Americal-Eurasian J. Agric. Environ. Sci., 2010, 8, 1, 40-43. [all data]

Dayisoylu and Alma, 2009
Dayisoylu, K.S.; Alma, M.H., Chemical analysis of essential oils from cone's rosin of Cilician fir (Abies cilicica subsp. cilicica), Afr. J. Biotechnol., 2009, 8, 15, 3502-3505. [all data]

Kazemi and Akhavani, 2009
Kazemi, M.; Akhavani, S., Constituents of Artemisia tournefortiana Rchb. essential oil from Iran, J. Appl. Chem. Res., 2009, 3, 10, 1-5. [all data]

Ali, Wurster, et al., 2008
Ali, N.A.A.; Wurster, M.; Arnold, N.; Teichert, A.; Schmidt, J.; Lindequist, U.; Wessjohann, L., Chemical composition and biological activities of essential oils from the oleogum resins of three endemic soqotraen Boswellia species, Rec. Nat. Prod., 2008, 2, 1, 6-12. [all data]

Mosayebi, Amin, et al., 2008
Mosayebi, M.; Amin, G.; Arzani, H.; Azarnivand, H.; Maleki, M.; Shafaghat, A., Effect of habitat on essential oil of Achillea filipendula L. in Iran, Asian J. Plant Sci., 2008, 7, 8, 779-781, https://doi.org/10.3923/ajps.2008.779.781 . [all data]

Tsokou, Georgopoulos, et al., 2007
Tsokou, A.; Georgopoulos, K.; Melliou, E.; Magiatis, P.; Tsitsa, E., Composition and enantiomeric analusis of the essential oil of the fruits and the leaves of Pistacia vera from Greece, Molecules, 2007, 12, 6, 1233-1239, https://doi.org/10.3390/12061233 . [all data]

Kowalski, 2005
Kowalski, R., Analysis of lipophylic fraction from leaves, inflorescences and rhizomes of Siphium perfoliatum L., Acta Soc. Botanicorum Poloniae, 2005, 74, 1, 5-10, https://doi.org/10.5586/asbp.2005.001 . [all data]