Methyl isocyanide-d3

Vibrational and/or electronic energy levels

Data compiled by: Takehiko Shimanouchi

Symmetry:   C     Symmetry Number σ = 3

 Sym.   No   Approximate   Selected Freq.  Infrared   Raman   Comments
 Species   type of mode   Value   Rating   Value  Phase  Value  Phase

a1 1 CD3 s-str 2251  B 2250.6 W gas
a1 2 NC str 2165  B 2165.0 W gas
a1 3 CD3 s-deform 1117  B 1117.4 W gas
a1 4 CN str 877  B 876.7 M gas
e 5 CD3 d-str 2263  B 2262.9 S gas
e 6 CD3 d-deform 1058  B 1058.2 S gas
e 7 CD3 rock 900  B 900.1 S gas
e 8 CNC bend 249  C OC28)

Source: Shimanouchi, 1972

References

Shimanouchi, 1972
Shimanouchi, T., Tables of Molecular Vibrational Frequencies Consolidated Volume I, National Bureau of Standards, 1972, 1-160. [all data]