tetrakis(1,1,1-trifluoro-5,5-dimethyl-2,4-hexanedionato)hafnium(IV)

Phase change data

Data compiled by: William E. Acree, Jr., James S. Chickos

Enthalpy of vaporization

ΔvapH (kJ/mol) Temperature (K) Method Reference Comment
92.1 ± 1.3460.GSMorozova, Zherikova, et al., 2008Based on data from 426. - 493. K.
91.2 ± 0.3448.N/AZherikova, Morozova, et al., 2008Based on data from 424. - 472. K.

Enthalpy of sublimation

ΔsubH (kJ/mol) Temperature (K) Method Reference Comment
135.3 ± 1.7403.GSMorozova, Zherikova, et al., 2008the enthalpy of sublimation that was reported in the paper, 97.5±1.7 kJ/mole, was not consistent with the reported Antoine constants. We have recalculated the the enthalpy of sublimation assuming that the reported Antoine constants are correct.
121.5 ± 0.8404.N/AZherikova, Morozova, et al., 2008Based on data from 386. - 423. K.

References

Morozova, Zherikova, et al., 2008
Morozova, Natalia B.; Zherikova, Ksenia V.; Baidina, Iraida A.; Sysoev, Sergei V.; Semyannikov, Pyotr P.; Yakovkina, Lyubov' V.; Smirnova, Tamara P.; Gelfond, Nikolay V.; Igumenov, Igor K.; Carta, Giovanni; Rossetto, Gilberto, Volatile hafnium(IV) compounds with beta-diketonate and cyclopentadienyl derivatives, Journal of Physics and Chemistry of Solids, 2008, 69, 2-3, 673-679, https://doi.org/10.1016/j.jpcs.2007.07.057 . [all data]

Zherikova, Morozova, et al., 2008
Zherikova, Ksenia V.; Morozova, Natalia B.; Zelenina, Ludmila N.; Sysoev, S.V.; Chusova, Tamara P.; Igumenov, I.K., Thermal properties of hafnium(IV) and zirconium(IV) β-diketonates, J Therm Anal Calorim, 2008, 92, 3, 729-734, https://doi.org/10.1007/s10973-008-9027-x . [all data]