3-hexanol, 4,4-diethyl-2,2-dimethyl-

Phase change data

Data compiled by: Thermodynamics Research Center, NIST Boulder Laboratories, Chris Muzny director

Quantity Value Units Method Reference Comment
Tboil500.15KN/AHaller and Bauer, 1913Uncertainty assigned by TRC = 4. K

In addition to the Thermodynamics Research Center (TRC) data available from this site, much more physical and chemical property data is available from the following TRC products:

References

Haller and Bauer, 1913
Haller, A.; Bauer, E., Ann. Chim. (Paris), 1913, 29, 8, 313. [all data]