11-Methylene pentacyclo[5.4.0.02,6.03,10.05,9]undecan-8-one

Gas phase ion energetics data

Data compiled by: Sharon G. Lias, John E. Bartmess, Joel F. Liebman, John L. Holmes, Rhoda D. Levin, and W. Gary Mallard

Ionization energy determinations

IE (eV) Method Reference Comment
8.95PEMarchand, Kaya, et al., 1984Vertical value

References

Marchand, Kaya, et al., 1984
Marchand, A.P.; Kaya, R.; Baker, A.D., A photoelectron spectroscopic study of proximity effects in 8,11-disubstituted pentacyclo(5.4.0.02,6.03,10.05,9)undecanes, Tetrahedron Lett., 1984, 25, 795. [all data]