1H-Indole-2,3-dione

Condensed phase thermochemistry data

Data compiled by: Hussein Y. Afeefy, Joel F. Liebman, and Stephen E. Stein

Quantity Value Units Method Reference Comment
Δfsolid-268.2 ± 3.8kJ/molCcbStern and Klebs, 1933Reanalyzed by Cox and Pilcher, 1970, Original value = -260. kJ/mol; Heat of combustion at 288 K
Quantity Value Units Method Reference Comment
Δcsolid-3594.5 ± 3.8kJ/molCcbStern and Klebs, 1933Reanalyzed by Cox and Pilcher, 1970, Original value = -3603. kJ/mol; Heat of combustion at 288 K

Phase change data

Data compiled as indicated in comments:
TRC - Thermodynamics Research Center, NIST Boulder Laboratories, Chris Muzny director
AC - William E. Acree, Jr., James S. Chickos

Quantity Value Units Method Reference Comment
Tfus473.KN/ABergmann, Fischer, et al., 1953Uncertainty assigned by TRC = 4. K; TRC
Tfus474.15KN/ACowley and Partington, 1936Uncertainty assigned by TRC = 1. K; TRC
Quantity Value Units Method Reference Comment
Δsub118.8 ± 5.1kJ/molCMatos, Miranda, et al., 2003AC

Enthalpy of fusion

ΔfusH (kJ/mol) Temperature (K) Method Reference Comment
27.82475.7DSCMartínez, Ávila, et al., 2003AC

In addition to the Thermodynamics Research Center (TRC) data available from this site, much more physical and chemical property data is available from the following TRC products:

References

Stern and Klebs, 1933
Stern, A.; Klebs, G., Calorimetrische bestimmungen bei mehrkernigen pyrrolderivaten. IV. 1. Experimentelle daten fur einige porphyrine, chlorine, phaophorbide and purpurine, Ann. Chim., 1933, 505, 295-306. [all data]

Cox and Pilcher, 1970
Cox, J.D.; Pilcher, G., Thermochemistry of Organic and Organometallic Compounds, Academic Press, New York, 1970, 1-636. [all data]

Bergmann, Fischer, et al., 1953
Bergmann, E.D.; Fischer, E.; Jaffe, J.H., Exalted Distortion Polarizations of Some COlored Hydrocarbons, J. Am. Chem. Soc., 1953, 75, 3230-3. [all data]

Cowley and Partington, 1936
Cowley, E.G.; Partington, J.R., Studies in dielectric polarisation. Part XV. The dipole moments of fivemembered nitrogen ring compounds: indole,skatole,carbazole,isatin, phthalimide, and succinimide., J. Chem. Soc., 1936, 1936, 47. [all data]

Matos, Miranda, et al., 2003
Matos, M. Agostinha R.; Miranda, Margarida S.; Morais, Victor M.F.; Liebman, Joel F., Are isatin and isatoic anhydride antiaromatic and aromatic respectively? A combined experimental and theoretical investigation, Org. Biomol. Chem., 2003, 1, 14, 2566-712, https://doi.org/10.1039/b304405j . [all data]

Martínez, Ávila, et al., 2003
Martínez, Fleming; Ávila, Carolina M.; Gómez, Alfredo, Thermodynamic study of the solubility of some sulfonamides in cyclohexane, J. Braz. Chem. Soc., 2003, 14, 5, 803-808, https://doi.org/10.1590/S0103-50532003000500016 . [all data]