Ditungsten tetrapropionate, dineopentyl-

Gas phase ion energetics data

Data compiled by: Sharon G. Lias, John E. Bartmess, Joel F. Liebman, John L. Holmes, Rhoda D. Levin, and W. Gary Mallard

Ionization energy determinations

IE (eV) Method Reference Comment
6.17PEChisholm, Clark, et al., 1987Vertical value

References

Chisholm, Clark, et al., 1987
Chisholm, M.H.; Clark, D.L.; Huffman, J.C.; Van Der Sluys, W.G.; Kober, E.M.; Lichtenberger, D.L.; Bursten, B.E., The tungsten-tungsten triple bond. 13. Bisalkyl tetracarboxylates of dimolybdenum and ditungsten. Triple bonds between metal atoms with the valence molecular orbital description 4 2, J. Am. Chem. Soc., 1987, 109, 6796. [all data]