Taurine

Condensed phase thermochemistry data

Data compiled by: Hussein Y. Afeefy, Joel F. Liebman, and Stephen E. Stein

Quantity Value Units Method Reference Comment
Δfsolid-774.5 ± 0.9kJ/molCcrYang, Pilcher, et al., 1994H2SO4(1:115)
Quantity Value Units Method Reference Comment
Δcsolid-1614.9 ± 0.8kJ/molCcrYang, Pilcher, et al., 1994H2SO4(1:115)

References

Yang, Pilcher, et al., 1994
Yang, M.-Y.; Pilcher, G.; Macnab, J.I., Standard enthalpies of formation in the crystalline state of aminomethanesulfonic acid, 2-aminoethanesulfonic acid, and the three aminobenzenesulfonic acids, J. Chem. Thermodyn., 1994, 26, 787-790. [all data]