Dimethylzinc dimethylsulfide complex

Phase change data

Data compiled by: Eugene S. Domalski and Elizabeth D. Hearing

Enthalpy of fusion

ΔfusH (kcal/mol) Temperature (K) Reference Comment
3.9486238.08Lebedev and Kulagina, 1993

Entropy of fusion

ΔfusS (cal/mol*K) Temperature (K) Reference Comment
16.59238.08Lebedev and Kulagina, 1993

References

Lebedev and Kulagina, 1993
Lebedev, B.V.; Kulagina, T.G., Thermodynamics of the (CH3)2ZnxS(CH3)2 complex at temperatures from 0 to 330 K, J. Chem. Thermodynam., 1993, 25(5), 591-598. [all data]