Samarium, bis(η5-pentamethylcyclopentadienyl)-

Gas phase ion energetics data

Data compiled by: Sharon G. Lias, John E. Bartmess, Joel F. Liebman, John L. Holmes, Rhoda D. Levin, and W. Gary Mallard

Ionization energy determinations

IE (eV) Method Reference Comment
5.37PEGreen, Hohl, et al., 1987Vertical value

Reaction thermochemistry data

Data compiled by: José A. Martinho Simões

Individual Reactions

Tetrahydrofuran (solution) + C20H30Sm (solution) = C24H38OSm (solution)

By formula: C4H8O (solution) + C20H30Sm (solution) = C24H38OSm (solution)

Quantity Value Units Method Reference Comment
Δr-7.29 ± 0.41kcal/molRSCNolan, Stern, et al., 1989solvent: Toluene

References

Green, Hohl, et al., 1987
Green, J.C.; Hohl, D.; Rosch, N., (Cyclopentadienyl)lanthanide compounds Ln(C5Me5)2 (Ln = Sm, Eu, Yb): Photoelectron spectra and molecular orbital calculations, Organometallics, 1987, 6, 712. [all data]