Diethylpropion

Normal alkane RI, non-polar column, custom temperature program

Data compiled by: NIST Mass Spectrometry Data Center, William E. Wallace, director

Column type CapillaryCapillaryCapillaryOtherCapillary
Active phase BP-1BP-1OV-1, SE-30, Methyl silicone, SP-2100, OV-101, DB-1, etc.Methyl SiliconeMethyl Silicone
Column length (m) 12.12.50.
Carrier gas HeHeHydrogen
Substrate
Column diameter (mm) 0.220.220.32
Phase thickness (μm) 0.250.25
Program 120 0X 8 0C/min -> 270 0C 25 0C/min -> 300 0C (5 min)not specifiednot specifiednot specifiednot specified
I 1483.1480.1470.1486.1485.
ReferenceStowell and Wilson, 1985Stowell and Wilson, 1985Waggott and Davies, 1984Ardrey and Moffat, 1981Pearson and Brown, 1978
Comment MSDC-RI MSDC-RI MSDC-RI MSDC-RI MSDC-RI

Phase change data

Data compiled as indicated in comments:
ALS - Hussein Y. Afeefy, Joel F. Liebman, and Stephen E. Stein
AC - William E. Acree, Jr., James S. Chickos

Quantity Value Units Method Reference Comment
Δvap71.6 ± 1.0kJ/molVWelle, Verevkin, et al., 1994ALS
Δvap71.6 ± 1.0kJ/molGSWelle, Verevkin, et al., 1994Based on data from 293. - 333. K.; AC

Normal alkane RI, non-polar column, temperature ramp

Data compiled by: NIST Mass Spectrometry Data Center, William E. Wallace, director

Column type CapillaryPackedPacked
Active phase BP-1OV-1SE-30
Column length (m) 12.2.2.
Carrier gas He
Substrate  Gas Chrom PGas Chrom P
Column diameter (mm) 0.22
Phase thickness (μm) 0.25
Tstart (C) 100.120.120.
Tend (C) 295.200.200.
Heat rate (K/min) 5.2.52.5
Initial hold (min)
Final hold (min)
I 1470.1465.1475.
ReferenceStowell and Wilson, 1985Marozzi, Gambaro, et al., 1982Marozzi, Gambaro, et al., 1982
Comment MSDC-RI MSDC-RI MSDC-RI

Kovats' RI, polar column, isothermal

Data compiled by: NIST Mass Spectrometry Data Center, William E. Wallace, director

Column type PackedPacked
Active phase PEG-20MPEG-20M
Column length (m)
Carrier gas N2
Substrate  Chromosorb W
Column diameter (mm)
Phase thickness (μm)
Temperature (C) 160.160.
I 1965.1965.
ReferenceHuber, Kenndler, et al., 1979Donike and Stratmann, 1976
Comment MSDC-RI MSDC-RI

References

Stowell and Wilson, 1985
Stowell, A.; Wilson, L., Use of retention indices in drug screening by capillary gas chromatography, Rep. # CD 2362, Department of Scientific and Industrial Reseach, Chemistry Division, Lower Hutt, NZ, 1985, 32. [all data]

Waggott and Davies, 1984
Waggott, A.; Davies, I.W., Identification of organic pollutants using linear temperature programmed retention indices (LTPRIs) - Part II, 1984, retrieved from http://dwi.defra.gov.uk/research/completed-research/reports/dwi0383.pdf. [all data]

Ardrey and Moffat, 1981
Ardrey, R.E.; Moffat, A.C., Gas-liquid chromatographic retention indices of 1318 substances of toxicological interest on SE-30 or OV-1 stationary phase, J. Chromatogr., 1981, 220, 3, 195-252, https://doi.org/10.1016/S0021-9673(00)81925-1 . [all data]

Pearson and Brown, 1978
Pearson, E.F.; Brown, C., The development and applications of the computer system of the Home Office Central Research Establishment, Instrument Applications in Forensic Drug Chemistry, Proceedings of the International Symposium, May 29-30, 1978, 1978, 299. [all data]