Pseudoephedrine

Normal alkane RI, polar column, isothermal

Data compiled by: NIST Mass Spectrometry Data Center, William E. Wallace, director

Column type CapillaryCapillaryCapillaryCapillaryCapillary
Active phase Carbowax 20M / KOHCarbowax 20M / KOHCarbowax 20M / KOHCarbowax 20M / KOHCarbowax 20M / KOH
Column length (m)
Carrier gas
Substrate
Column diameter (mm)
Phase thickness (μm)
Temperature (C) 150.150.150.190.190.
I 2185.2195.2205.2213.2217.
ReferenceCaddy, Fish, et al., 1973Caddy, Fish, et al., 1973Caddy, Fish, et al., 1973Caddy, Fish, et al., 1973Caddy, Fish, et al., 1973
Comment MSDC-RI MSDC-RI MSDC-RI MSDC-RI MSDC-RI
Column type Capillary
Active phase Carbowax 20M / KOH
Column length (m)
Carrier gas
Substrate
Column diameter (mm)
Phase thickness (μm)
Temperature (C) 190.
I 2225.
ReferenceCaddy, Fish, et al., 1973
Comment MSDC-RI

Van Den Dool and Kratz RI, non-polar column, temperature ramp

Data compiled by: NIST Mass Spectrometry Data Center, William E. Wallace, director

Column type CapillaryCapillaryCapillaryPacked
Active phase SPB-1DB-1DB-1SE-30
Column length (m) 30.15.15.1.8
Carrier gas HeHeHeN2
Substrate    Chromosorb W
Column diameter (mm) 0.750.320.25
Phase thickness (μm) 1.00.250.25
Tstart (C) 160.120.120.130.
Tend (C) 280.280.280.290.
Heat rate (K/min) 10.8.8.8.
Initial hold (min)    2.
Final hold (min) 12.5.5.8.
I 1376.1360.1360.1350.
ReferenceChrist, Noomano, et al., 1988Perrigo, Peel, et al., 1985Perrigo, Ballantyne, et al., 1984Perrigo and Peel, 1981
Comment MSDC-RI MSDC-RI MSDC-RI MSDC-RI

Van Den Dool and Kratz RI, non-polar column, custom temperature program

Data compiled by: NIST Mass Spectrometry Data Center, William E. Wallace, director

Column type Capillary
Active phase BP-1
Column length (m) 12.
Carrier gas He
Substrate
Column diameter (mm) 0.22
Phase thickness (μm) 0.25
Program 120C => 8C/min => 270C => 25C/min => 300C
I 1350.
ReferenceStowell and Wilson, 1987
Comment MSDC-RI

Phase change data

Data compiled by: William E. Acree, Jr., James S. Chickos

Enthalpy of fusion

ΔfusH (kcal/mol) Temperature (K) Method Reference
7.636392.4DSCLi, Zell, et al., 1999

References

Caddy, Fish, et al., 1973
Caddy, B.; Fish, F.; Scott, D., Chromatographic screening for drugs of abuse using capillary columds. II. Peak identification on support coated open tubular columns for a series of central nervous system stimulating drugs, Chromatographia, 1973, 6, 7, 293-300, https://doi.org/10.1007/BF02269329 . [all data]