(.+-.)-5,8,8-trimethyl-3-oxabicylo[3.2.1]octan-2-one

Phase change data

Data compiled by: Thermodynamics Research Center, NIST Boulder Laboratories, Chris Muzny director

Quantity Value Units Method Reference Comment
Ttriple487.9KN/AWeinstein, Leffler, et al., 1984Crystal phase 1 phase; Uncertainty assigned by TRC = 1.5 K

In addition to the Thermodynamics Research Center (TRC) data available from this site, much more physical and chemical property data is available from the following TRC products:

References

Weinstein, Leffler, et al., 1984
Weinstein, D.I.; Leffler, A.J.; Currie, J.A., Phase Transitions in Bicyclic Compounds, Mol. Cryst. Liq. Cryst., 1984, 104, 95. [all data]