N-(diethylaminothiocarbonyl)-N',N'-diethylbenzamide

Phase change data

Data compiled by: William E. Acree, Jr., James S. Chickos

Quantity Value Units Method Reference Comment
Δsub122.2 ± 2.0kJ/molCRibeiro da Silva, Santos, et al., 2004

References

Ribeiro da Silva, Santos, et al., 2004
Ribeiro da Silva, Manuel A.V.; Santos, Luis M.N.B.F.; Schröder, Bernd; Beyer, Lothar, Thermochemical studies of three N-thiocarbamoylbenzamidines, The Journal of Chemical Thermodynamics, 2004, 36, 7, 555-559, https://doi.org/10.1016/j.jct.2004.03.015 . [all data]