[1,1'-Bicyclohexyl]-2-one

Gas phase thermochemistry data

Data compiled by: Hussein Y. Afeefy, Joel F. Liebman, and Stephen E. Stein

Quantity Value Units Method Reference Comment
Δfgas-77.43 ± 0.37kcal/molCcbMarachik, Kozyro, et al., 1992Hfusion=18.00±0.40 kJ/mol

Condensed phase thermochemistry data

Data compiled by: Hussein Y. Afeefy, Joel F. Liebman, and Stephen E. Stein

Quantity Value Units Method Reference Comment
Δfsolid-93.45 ± 0.33kcal/molCcbMarachik, Kozyro, et al., 1992Hfusion=18.00±0.40 kJ/mol
Quantity Value Units Method Reference Comment
Δcsolid-1718.33 ± 0.23kcal/molCcbMarachik, Kozyro, et al., 1992Hfusion=18.00±0.40 kJ/mol; Corresponding Δfsolid = -93.435 kcal/mol (simple calculation by NIST; no Washburn corrections)

References

Marachik, Kozyro, et al., 1992
Marachik, L.I.; Kozyro, A.A.; Simirskii, V.V.; Kabo, G.Ya.; Yursha, I.A.; Krasulin, A.P.; Sevruk, V.M., Thermodynamic characteristics of by-products from caprolactam synthesis, J. Appl. Chem. USSR, 1992, 65, 710-715. [all data]