Primaquine

Van Den Dool and Kratz RI, non-polar column, temperature ramp

Data compiled by: NIST Mass Spectrometry Data Center, William E. Wallace, director

Column type Packed
Active phase SE-30
Column length (m) 1.8
Carrier gas N2
Substrate Chromosorb W
Column diameter (mm)
Phase thickness (μm)
Tstart (C) 130.
Tend (C) 290.
Heat rate (K/min) 8.
Initial hold (min) 2.
Final hold (min) 8.
I 2315.
ReferencePerrigo and Peel, 1981
Comment MSDC-RI

References

Perrigo and Peel, 1981
Perrigo, B.J.; Peel, H.W., The use of retention indices and temperature-programmed gas chromatography in analytical toxicology, J. Chromatogr. Sci., 1981, 19, 5, 219-226, https://doi.org/10.1093/chromsci/19.5.219 . [all data]