Hymecromone

Phase change data

Data compiled as indicated in comments:
DH - Eugene S. Domalski and Elizabeth D. Hearing
AC - William E. Acree, Jr., James S. Chickos

Enthalpy of fusion

ΔfusH (kJ/mol) Temperature (K) Reference Comment
29.139460.7Zhang, Huang, et al., 1989DH
29.14460.7Domalski and Hearing, 1996AC

Entropy of fusion

ΔfusS (J/mol*K) Temperature (K) Reference Comment
63.42460.7Zhang, Huang, et al., 1989DH

Normal alkane RI, non-polar column, custom temperature program

View large format table.

Column type Active phase I Reference Comment
OtherMethyl Silicone2003.Ardrey and Moffat, 1981Program: not specified

References

Zhang, Huang, et al., 1989
Zhang, X.; Huang, W.; Tan, F.; Xu, G.; Wu, Z., Study on phase transition thermodynamics of 4-methyl-coumarin derivative, Chin. Sci. Bull., 1989, 34(21), 1844-1845. [all data]

Domalski and Hearing, 1996
Domalski, Eugene S.; Hearing, Elizabeth D., Heat Capacities and Entropies of Organic Compounds in the Condensed Phase. Volume III, J. Phys. Chem. Ref. Data, 1996, 25, 1, 1, https://doi.org/10.1063/1.555985 . [all data]