Poly[oxy(dimethylsilylene)]

Phase change data

Data compiled by: Eugene S. Domalski and Elizabeth D. Hearing

Enthalpy of fusion

ΔfusH (kJ/mol) Temperature (K) Reference Comment
2.750219.Varma-Nair, Wesson, et al., 1989100% crystallinity.
2.750219.Varma-Nair, Wesson, et al., 1989100% crystallinity.
4.540246.Lebedev, Mukhina, et al., 1978Degree of crystallinity is 67%.

Entropy of fusion

ΔfusS (J/mol*K) Temperature (K) Reference Comment
18.6246.Lebedev, Mukhina, et al., 1978Degree

References

Varma-Nair, Wesson, et al., 1989
Varma-Nair, M.; Wesson, J.P.; Wunderlich, B., The thermal properties of polysiloxanes poly(dimethyl siloxane) and poly(diethyl siloxane), J. Therm. Anal., 1989, 35(6), 1913-1939. [all data]

Lebedev, Mukhina, et al., 1978
Lebedev, B.V.; Mukhina, N.N.; Kulagina, T.G., Thermodynamics of polydimethylsiloxane in the range 0-350°K, Vysokomol. Soedin., 1978, A20, 1297-1303. [all data]