(1α,4α,6α,9α)Tricyclo[7.1.0.04,6]decane

Condensed phase thermochemistry data

Data compiled by: Hussein Y. Afeefy, Joel F. Liebman, and Stephen E. Stein

Quantity Value Units Method Reference Comment
Δcliquid-1474.9kcal/molCcbGollis, Belenyessy, et al., 1962Corresponding Δfliquid = -12.1 kcal/mol (simple calculation by NIST; no Washburn corrections)

References

Gollis, Belenyessy, et al., 1962
Gollis, M.H.; Belenyessy, L.I.; Gudzinowicz, B.J.; Koch, S.D.; Smith, J.O.; Wineman, R.J., Evaluation of pure hydrocarbons as jet fuels, J. Chem. Eng. Data, 1962, 7, 331-316. [all data]