2,6-Dimethyldibenzothiophene

Lee's RI, non-polar column, temperature ramp

View large format table.

Column type Active phase I Reference Comment
CapillaryDB-5MS331.28Schade and Andersson, 200630. m/0.25 mm/0.25 μm, He, 60. C @ 1. min, 10. K/min; Tend: 300. C
CapillarySE-30332.81Wang, Xue, et al., 1994Nitrogen, 4. K/min; Column length: 25. m; Column diameter: 0.20 mm; Tstart: 80. C; Tend: 290. C
CapillaryDB-5336.5Viau, Studak, et al., 1984Helium, 4. K/min; Column length: 30. m; Column diameter: 0.32 mm; Tstart: 90. C; Tend: 250. C
CapillarySE-52332.42Vassilaros, Kong, et al., 198220. m/0.30 mm/0.25 μm, H2, 40. C @ 2. min, 4. K/min; Tend: 265. C

Lee's RI, non-polar column, custom temperature program

View large format table.

Column type Active phase I Reference Comment
CapillaryDB-5328.83Mössner, de Alda, et al., 199960. m/0.25 mm/0.25 μm, He; Program: 60C (1 min) => 45 C/min => 150C (2 min) => 2 C/min => 300 C (25 min)
CapillarySE-30332.42Wang, Xue, et al., 1994Nitrogen; Column length: 25. m; Column diameter: 0.20 mm; Program: not specified
CapillaryCP Sil 8 CB332.7Bundt, Herbel, et al., 199150. m/0.25 mm/0.25 μm, He; Program: not specified

References

Schade and Andersson, 2006
Schade, T.; Andersson, J.T., Speciation of alkylated dibenzothiophenes through correlation of structure and gas chromatographic retention indexes, J. Chromatogr. A, 2006, 1117, 2, 206-213, https://doi.org/10.1016/j.chroma.2006.03.079 . [all data]

Wang, Xue, et al., 1994
Wang, X.; Xue, W.; Zhu, J.; Gu, Y.; Sheng, G.; Fu, J., Characterization of polynuclear aromatic sulfur heterocycles in a coal, J. Fuel Chemistry and Technology, 1994, 22, 2, 196-202. [all data]

Viau, Studak, et al., 1984
Viau, A.C.; Studak, S.M.; Karasek, F.W., Comparative analysis of hazardous compounds on flu-ash from municipal waste incineration by gas chromatography / mass spectrometry, Can. J. Chem., 1984, 62, 11, 2140-2145, https://doi.org/10.1139/v84-366 . [all data]

Vassilaros, Kong, et al., 1982
Vassilaros, D.L.; Kong, R.C.; Later, D.W.; Lee, M.L., Linear retention index system for polycyclic aromatic compounds. Critical evaluation and additional indices, J. Chromatogr., 1982, 252, 1-20, https://doi.org/10.1016/S0021-9673(01)88394-1 . [all data]

Mössner, de Alda, et al., 1999
Mössner, S.G.; de Alda, M.J.L.; Sander, L.C.; Lee, M.L.; Wise, S.A., Gas chromatographic retention behavior of polycyclic aromatic sulfur heterocyclic compounds, (dibenzothiophene, naphtho[b]thiophenes, benzo[b]naphthothiophenes and alkyl-substituted derivatives) on stationary phases of different selectivity, J. Chromatogr. A, 1999, 841, 2, 207-228, https://doi.org/10.1016/S0021-9673(99)00363-5 . [all data]

Bundt, Herbel, et al., 1991
Bundt, J.; Herbel, W.; Steinhart, H.; Franke, S.; Francke, W., Structure-type separation of diesel fuels by solid phase extraction and identification of the two- and three-ring aromatics by capillary GC-mass spectrometry, J. Hi. Res. Chromatogr., 1991, 14, 2, 91-98, https://doi.org/10.1002/jhrc.1240140205 . [all data]