Cyclohexanone, 5-methyl-2-(1-methylethyl)-, trans-

Van Den Dool and Kratz RI, polar column, temperature ramp

Data compiled by: NIST Mass Spectrometry Data Center, William E. Wallace, director

Column type CapillaryCapillaryCapillaryCapillaryCapillary
Active phase BP-20DB-WaxFFAPDB-WaxDB-Wax
Column length (m) 50.30.20.60.60.
Carrier gas HeHeHeN2N2
Substrate
Column diameter (mm) 0.220.250.250.250.25
Phase thickness (μm) 0.250.250.250.250.25
Tstart (C) 60.40.90.70.70.
Tend (C) 220.240.220.230.230.
Heat rate (K/min) 2.6.4.2.2.
Initial hold (min)  10.2.2.2.
Final hold (min) 20.25. 20.20.
I 1467.1438.1504.1473.1474.
ReferenceCastilho, Liu, et al., 2007Varming, Andersen, et al., 2006Agnihotri, Agarwal, et al., 2005Choi, 2005Choi, 2003
Comment MSDC-RI MSDC-RI MSDC-RI MSDC-RI MSDC-RI
Column type CapillaryCapillaryCapillaryCapillaryCapillary
Active phase AT-WaxBP-20DB-WaxDB-WaxCarbowax 20M
Column length (m) 60.50.60.25.60.
Carrier gas He N2HeHe
Substrate
Column diameter (mm) 0.320.220.250.250.32
Phase thickness (μm) 0.250.250.250.250.425
Tstart (C) 65.60.70.50.45.
Tend (C) 250.220.230.240.300.
Heat rate (K/min) 2.2.2.4.3.
Initial hold (min) 10. 2.3.3.
Final hold (min) 60.20.20. 20.
I 1448.1456.1476.1451.1458.
ReferencePino and Marbot, 2001Baldovini, Ristorcelli, et al., 2000Choi and Sawamura, 2000Möllenbeck, König, et al., 1997Mondello, Dugo, et al., 1995
Comment MSDC-RI MSDC-RI MSDC-RI MSDC-RI MSDC-RI

Normal alkane RI, polar column, custom temperature program

Data compiled by: NIST Mass Spectrometry Data Center, William E. Wallace, director

Column type CapillaryCapillaryCapillaryCapillaryCapillary
Active phase Innowax FSCDB-FFAPDB-FFAPHP-InnowaxCarbowax 20M
Column length (m) 60.30.30.50.
Carrier gas HeliumHeliumHeliumHe
Substrate
Column diameter (mm) 0.250.250.250.2
Phase thickness (μm) 0.250.250.250.2
Program 60 0C (10 min) 4 0C/min -> 220 0C (10 min) 1 0C/min -> 240 0C50 0C 2 0C/min -> 100 0C (5 min) 5 0C/min -> 250 0Cnot specified40C(5min) => 2C/min => 250C (15min) => 10C/min => 270Cnot specified
I 1475.1427.1427.1475.1478.
ReferenceDemirci, Temel, et al., 2011Mebazaa, Mahmoudi, et al., 2009Mebazaa, Mahmoudi, et al., 2009Senatore, Apostolides Arnold, et al., 2006Vinogradov, 2004
Comment MSDC-RI MSDC-RI MSDC-RI MSDC-RI MSDC-RI
Column type CapillaryCapillaryCapillaryCapillaryCapillary
Active phase HP-InnowaxInnowax FSCHP-InnowaxCarbowax 20MCarbowax 400, Carbowax 20M, Carbowax 1540, Carbowax 4000, Superox 06, PEG 20M, etc.
Column length (m) 60.60.60. 50.
Carrier gas HeHeHe Hydrogen
Substrate
Column diameter (mm) 0.250.250.25 0.32
Phase thickness (μm) 0.250.250.25
Program 60 0C (10 min) 4 K/min -> 220 0C (10 min) 1 K/min -> 240 0C60C(10min) => 4C/min => 220C(10min) => 1C/min => 240C60C(10min) => 4C/min => 220C(10min) => 1C/min => 240Cnot specifiednot specified
I 1475.1475.1475.1478.1432.
ReferenceBaser, Demirci, et al., 2002Tabanca N., Demirci F., et al., 2001Tabanca, Kirimer, et al., 2001Shibamoto, 1987Waggott and Davies, 1984
Comment MSDC-RI MSDC-RI MSDC-RI MSDC-RI MSDC-RI

Van Den Dool and Kratz RI, non-polar column, custom temperature program

Data compiled by: NIST Mass Spectrometry Data Center, William E. Wallace, director

Column type CapillaryCapillaryCapillaryCapillary
Active phase SE-52BPX-5CP Sil 5 CBSE-52
Column length (m) 30.30. 60.
Carrier gas He  He
Substrate
Column diameter (mm) 0.320.25 0.32
Phase thickness (μm) 0.150.25 0.40
Program 45C => 1C/min => 100C => 5C/min => 250C(10min)35C(5min) => 3C/min => 210C => 40C/min => 240C (4min)not specified45 C (6 min) 3 C/min -> 111 0C 2 C/min -> 160 C 3 C/min -> 300 C (15 min)
I 1155.1172.1143.1156.
ReferenceBruni, Bianchi, et al., 2007Cardeal, da Silva, et al., 2006Chanegriha, Baaliouamer, et al., 1998Mondello, Dugo, et al., 1995
Comment MSDC-RI MSDC-RI MSDC-RI MSDC-RI

Van Den Dool and Kratz RI, polar column, custom temperature program

Data compiled by: NIST Mass Spectrometry Data Center, William E. Wallace, director

Column type CapillaryCapillaryCapillary
Active phase CP-Wax 52CBDB-WaxBP-20
Column length (m) 60.30.
Carrier gas HeHeHe
Substrate
Column diameter (mm) 0.250.25
Phase thickness (μm) 0.250.25
Program 45C(5min) => 10C/min => 80C => 2C/min => 240C60C => 5C/min => 200C => 6C/min => 250C(5min)not specified
I 1472.1486.1478.
ReferenceRomeo, Ziino, et al., 2007Guillot, Peytavi, et al., 2006Chanegriha, Baaliouamer, et al., 1998
Comment MSDC-RI MSDC-RI MSDC-RI

References

Castilho, Liu, et al., 2007
Castilho, P.; Liu, K.; Rodrigues, A.I.; Feio, S.; Tomi, F.; Casanova, J., Composition and antimicrobial activity of the essential oil of Clinopodium ascendens (Jordan) Sampaio from Madeira, Flavour Fragr. J., 2007, 22, 2, 139-144, https://doi.org/10.1002/ffj.1771 . [all data]

Varming, Andersen, et al., 2006
Varming, C.; Andersen, M.L.; Poll, L., Volatile Monoterpenes in Black Currant (Ribes nigrum L.) Juice: Effects of Heating and Enzymatic Treatment by β-Glucosidase, J. Agric. Food Chem., 2006, 54, 6, 2298-2302, https://doi.org/10.1021/jf051938k . [all data]

Agnihotri, Agarwal, et al., 2005
Agnihotri, V.K.; Agarwal, S.G.; Dhar, P.L.; Thappa, R.K.; Baleshwar; Kapahi, B.K.; Saxena, R.K.; Qazi, G.N., Essential oil composition of Mentha pulegium L. growing wild in the north-western Himalayas India, Flavour Fragr. J., 2005, 20, 6, 607-610, https://doi.org/10.1002/ffj.1497 . [all data]

Choi, 2005
Choi, H.-S., Characteristic odor components of kumquat (Fortunella japonica Swingle) peel oil, J. Agric. Food Chem., 2005, 53, 5, 1642-1647, https://doi.org/10.1021/jf040324x . [all data]

Choi, 2003
Choi, H.-S., Character impact odorants of Citrus Hallabong [(C. unshiu Marcov × C. sinensis Osbeck) × C. reticulata Blanco] cold-pressed peel oil, J. Agric. Food Chem., 2003, 51, 9, 2687-2692, https://doi.org/10.1021/jf021069o . [all data]

Pino and Marbot, 2001
Pino, J.A.; Marbot, R., Volatile flavor constituents of acerola (Malpighia emarginata DC.) fruit, J. Agric. Food Chem., 2001, 49, 12, 5880-5882, https://doi.org/10.1021/jf010270g . [all data]

Baldovini, Ristorcelli, et al., 2000
Baldovini, N.; Ristorcelli, D.; Tomi, F.; Casanova, J., Infraspecific variability of the essential oil of Calamintha nepeta from Corsica (France), Flavour Fragr. J., 2000, 15, 1, 50-54, https://doi.org/10.1002/(SICI)1099-1026(200001/02)15:1<50::AID-FFJ871>3.0.CO;2-F . [all data]

Choi and Sawamura, 2000
Choi, H.-S.; Sawamura, M., Composition of the essential oil of Citrus tamurana Hort. ex Tanaka (Hyuganatsu), J. Agric. Food Chem., 2000, 48, 10, 4868-4873, https://doi.org/10.1021/jf000651e . [all data]

Möllenbeck, König, et al., 1997
Möllenbeck, S.; König, T.; Schreier, P.; Schwab, W.; Rajaonarivony, J.; Ranarivelo, L., Chemical composition and analyses of enantiomers of essential oils from Madagascar, Flavour Fragr. J., 1997, 12, 2, 63-69, https://doi.org/10.1002/(SICI)1099-1026(199703)12:2<63::AID-FFJ614>3.0.CO;2-Z . [all data]

Mondello, Dugo, et al., 1995
Mondello, L.; Dugo, P.; Basile, A.; Dugo, G., Interactive use of linear retention indices, on polar and apolar columns, with a MS-library for reliable identification of complex mixtures, J. Microcolumn Sep., 1995, 7, 6, 581-591, https://doi.org/10.1002/mcs.1220070605 . [all data]