Cyclohexanol, 5-methyl-2-(1-methylethyl)-, (1α,2β,5α)-

Normal alkane RI, non-polar column, isothermal

Data compiled by: NIST Mass Spectrometry Data Center, William E. Wallace, director

Column type Packed
Active phase Polydimethyl siloxane
Column length (m)
Carrier gas
Substrate
Column diameter (mm)
Phase thickness (μm)
Temperature (C) 150.
I 1178.
ReferenceMaume, 1968
Comment MSDC-RI

Kovats' RI, non-polar column, temperature ramp

Data compiled by: NIST Mass Spectrometry Data Center, William E. Wallace, director

Column type CapillaryCapillaryCapillaryCapillaryCapillary
Active phase DB-5BP-1BP-1BP-1HP-5
Column length (m) 50.25.25.25.25.
Carrier gas HeN2 N2H2
Substrate
Column diameter (mm) 0.320.50.50.550.32
Phase thickness (μm) 0.250.250.250.250.52
Tstart (C) 50.60.60.60.40.
Tend (C) 280.220.220.220.240.
Heat rate (K/min) 5.5.5.5.4.
Initial hold (min) 2.
Final hold (min) 10.10.10.15.
I 1185.1169.1169.1173.1173.
ReferenceBaranauskiene, Venskutonis, et al., 2003Rajeswara Rao, 2002Rao B.R.R., 2002Jain, Aggarwal, et al., 2001Kitic, Palic, et al., 2001
Comment MSDC-RI MSDC-RI MSDC-RI MSDC-RI MSDC-RI
Column type CapillaryCapillaryCapillaryCapillary
Active phase DB-5BPX-5DB-5OV-1
Column length (m) 30.50.30.23.
Carrier gas HeN2 H2
Substrate
Column diameter (mm) 0.250.22 0.32
Phase thickness (μm) 0.250.25 0.3
Tstart (C) 40.60.40.50.
Tend (C) 250.185.210.200.
Heat rate (K/min) 2.2.2.3.
Initial hold (min) 5.10.2.
Final hold (min) 20. 120.
I 1141.1172.1174.1162.
Referencede Feo, Porta, et al., 1998Fournier, Hadjiakhoondi, et al., 1997Loayza, Abujder, et al., 1995Bicchi, Frattini, et al., 1988
Comment MSDC-RI MSDC-RI MSDC-RI MSDC-RI

Lee's RI, non-polar column, custom temperature program

Data compiled by: NIST Mass Spectrometry Data Center, William E. Wallace, director

Column type Capillary
Active phase Methyl Silicone
Column length (m)
Carrier gas
Substrate
Column diameter (mm)
Phase thickness (μm)
Program not specified
I 198.32
ReferenceEckel, Ross, et al., 1993
Comment MSDC-RI

References

Maume, 1968
Maume, B., Retention time in gas chromatography and characterization of monoterpenoids and cyclohexane derivatives, 4th International Symposium on Chromatography and Electrophoresis, Brussel, 1968, 575. [all data]