1,4:5,8-Dimethanophthalazine, 1,4,4a,5,6,7,8,8a-octahydro-10,10-dimethyl- (1α,4α,4aα,5α,8α,8aα)-

Gas phase ion energetics data

Data compiled by: Sharon G. Lias, John E. Bartmess, Joel F. Liebman, John L. Holmes, Rhoda D. Levin, and W. Gary Mallard

Ionization energy determinations

IE (eV) Method Reference Comment
8.0PEBeck, Hunig, et al., 1986
8.40PEBeck, Hunig, et al., 1986Vertical value

References

Beck, Hunig, et al., 1986
Beck, K.; Hunig, S.; Kleefeld, G.; Martin, H.-D.; Peters, K.; Prokschy, F.; von Schnering, H.G., Photoelectron and UV spectroscopic investigations of homoconjugative interactions between parallel C=C and N=N bonds, Chem. Ber., 1986, 119, 543. [all data]